BDBM50445211 CHEMBL3103636
SMILES: FC(F)(F)Oc1ccc(NC(=O)Nc2ccccc2N2CC3(CCCC3)c3ccccc23)cc1
InChI Key: InChIKey=VLVYGPOBUIHHAE-UHFFFAOYSA-N
Data: 1 KI  1 IC50
Activity Spreadsheet -- Enzyme Inhibition Constant Data from BindingDB
Found 2 hits for monomerid = 50445211
Trg + Lig
Ki
nM
ΔG°
kcal/mole
IC50
nM
Kd
nM
EC50/IC50
nM
koff
s-1
kon
M-1s-1
pHTemp
°C
Purinergic receptor P2Y1
(Homo sapiens (Human))
BDBM50445211
(CHEMBL3103636)
Show SMILES FC(F)(F)Oc1ccc(NC(=O)Nc2ccccc2N2CC3(CCCC3)c3ccccc23)cc1
Show InChI InChI=1S/C26H24F3N3O2/c27-26(28,29)34-19-13-11-18(12-14-19)30-24(33)31-21-8-2-4-10-23(21)32-17-25(15-5-6-16-25)20-7-1-3-9-22(20)32/h1-4,7-14H,5-6,15-17H2,(H2,30,31,33)
6.60n/an/an/an/an/an/an/an/a
Bristol-Myers Squibb Company
Curated by ChEMBL
Assay Description
Displacement of [33P]-2MeS-ADP from human P2Y1 receptor expressed in HEK293 cells after 1 hr by scintillation counting analysis
J Med Chem 56: 9275-95 (2013)
Article DOI: 10.1021/jm4013906
BindingDB Entry DOI: 10.7270/Q2KW5HHP
Purinergic receptor P2Y1
(Homo sapiens (Human))
BDBM50445211
(CHEMBL3103636)
Show SMILES FC(F)(F)Oc1ccc(NC(=O)Nc2ccccc2N2CC3(CCCC3)c3ccccc23)cc1
Show InChI InChI=1S/C26H24F3N3O2/c27-26(28,29)34-19-13-11-18(12-14-19)30-24(33)31-21-8-2-4-10-23(21)32-17-25(15-5-6-16-25)20-7-1-3-9-22(20)32/h1-4,7-14H,5-6,15-17H2,(H2,30,31,33)
n/an/a 2.40E+3n/an/an/an/an/an/a
Bristol-Myers Squibb Company
Curated by ChEMBL
Assay Description
Antagonist activity at P2Y1 receptor in platelet-enriched human plasma assessed as 2.5 uM ADP-induced platelet aggregation preincubated for 1 min fol...
J Med Chem 56: 9275-95 (2013)
Article DOI: 10.1021/jm4013906
BindingDB Entry DOI: 10.7270/Q2KW5HHP