BDBM50445216 CHEMBL3103632
SMILES: CC1(C)CN(c2ccccc2NC(=O)Nc2ccc(OC(F)(F)F)cc2)c2ccccc2O1
InChI Key: InChIKey=XFIAOQQYXCGDIW-UHFFFAOYSA-N
Data: 1 KI  1 IC50
Activity Spreadsheet -- Enzyme Inhibition Constant Data from BindingDB
Found 2 hits for monomerid = 50445216
Trg + Lig
Ki
nM
ΔG°
kcal/mole
IC50
nM
Kd
nM
EC50/IC50
nM
koff
s-1
kon
M-1s-1
pHTemp
°C
Purinergic receptor P2Y1
(Homo sapiens (Human))
BDBM50445216
(CHEMBL3103632)
Show SMILES CC1(C)CN(c2ccccc2NC(=O)Nc2ccc(OC(F)(F)F)cc2)c2ccccc2O1
Show InChI InChI=1S/C24H22F3N3O3/c1-23(2)15-30(20-9-5-6-10-21(20)33-23)19-8-4-3-7-18(19)29-22(31)28-16-11-13-17(14-12-16)32-24(25,26)27/h3-14H,15H2,1-2H3,(H2,28,29,31)
39n/an/an/an/an/an/an/an/a
Bristol-Myers Squibb Company
Curated by ChEMBL
Assay Description
Displacement of [33P]-2MeS-ADP from human P2Y1 receptor expressed in HEK293 cells after 1 hr by scintillation counting analysis
J Med Chem 56: 9275-95 (2013)
Article DOI: 10.1021/jm4013906
BindingDB Entry DOI: 10.7270/Q2KW5HHP
Purinergic receptor P2Y1
(Homo sapiens (Human))
BDBM50445216
(CHEMBL3103632)
Show SMILES CC1(C)CN(c2ccccc2NC(=O)Nc2ccc(OC(F)(F)F)cc2)c2ccccc2O1
Show InChI InChI=1S/C24H22F3N3O3/c1-23(2)15-30(20-9-5-6-10-21(20)33-23)19-8-4-3-7-18(19)29-22(31)28-16-11-13-17(14-12-16)32-24(25,26)27/h3-14H,15H2,1-2H3,(H2,28,29,31)
n/an/a>1.00E+4n/an/an/an/an/an/a
Bristol-Myers Squibb Company
Curated by ChEMBL
Assay Description
Antagonist activity at P2Y1 receptor in platelet-enriched human plasma assessed as 2.5 uM ADP-induced platelet aggregation preincubated for 1 min fol...
J Med Chem 56: 9275-95 (2013)
Article DOI: 10.1021/jm4013906
BindingDB Entry DOI: 10.7270/Q2KW5HHP