null
SMILES: C[C@@H]1NC(=O)[C@@H]2CSSC[C@H](NC(=O)CN)C(=O)N[C@@H](CSSC[C@H](NC(=O)[C@H](CCCN=C(N)N)NC(=O)[C@H](Cc3c[nH]c4ccccc34)NC1=O)C(N)=O)C(=O)N[C@@H](CO)C(=O)N[C@@H](CC(O)=O)C(=O)N1CCC[C@H]1C(=O)N[C@@H](CCCN=C(N)N)C(=O)N2
InChI Key: InChIKey=AIKMSOHWSGWCNX-VAYQAVKTSA-N
Activity Spreadsheet -- Enzyme Inhibition Constant Data from BindingDB
Found 6 hits for monomerid = 50445329
Trg + Lig
Ki
nM
ΔG°
kcal/mole
IC50
nM
Kd
nM
EC50/IC50
nM
koff
s-1
kon
M-1s-1
pHTemp
°C
Neuronal acetylcholine receptor subunit alpha-3/beta-4
(Homo sapiens (Human))
BDBM50445329
(CHEMBL3104242)
Show SMILES C[C@@H]1NC(=O)[C@@H]2CSSC[C@H](NC(=O)CN)C(=O)N[C@@H](CSSC[C@H](NC(=O)[C@H](CCCN=C(N)N)NC(=O)[C@H](Cc3c[nH]c4ccccc34)NC1=O)C(N)=O)C(=O)N[C@@H](CO)C(=O)N[C@@H](CC(O)=O)C(=O)N1CCC[C@H]1C(=O)N[C@@H](CCCN=C(N)N)C(=O)N2 |r,wU:65.68,80.84,1.0,39.39,28.28,wD:10.10,19.18,59.62,76.79,5.94,24.55,(35.13,-22.24,;33.59,-22.21,;32.85,-20.87,;33.65,-19.55,;35.17,-19.58,;32.9,-18.21,;31.36,-18.18,;30.57,-19.5,;15.44,-12.7,;16.79,-10.97,;16.78,-9.44,;15.44,-8.69,;14.12,-9.46,;14.14,-11,;12.78,-8.7,;11.45,-9.48,;18.11,-8.65,;18.1,-7.11,;19.45,-9.41,;19.5,-10.96,;18.18,-11.74,;18.2,-13.29,;23.43,-23.77,;24.75,-24.55,;24.72,-26.1,;26.05,-26.89,;27.39,-26.14,;27.41,-24.59,;28.72,-26.93,;28.7,-28.46,;27.35,-29.21,;27.33,-30.75,;25.99,-31.5,;25.97,-33.04,;27.29,-33.82,;24.63,-33.8,;30.06,-26.18,;31.38,-26.96,;31.36,-28.5,;32.74,-26.19,;33.8,-27.31,;35.29,-26.94,;35.88,-25.53,;37.41,-25.64,;37.78,-27.14,;39.13,-27.86,;39.17,-29.39,;37.86,-30.21,;36.52,-29.47,;36.48,-27.94,;33.54,-24.89,;32.8,-23.55,;31.25,-23.52,;23.39,-26.85,;22.06,-26.06,;23.36,-28.38,;20.95,-11.55,;21.14,-13.08,;22.18,-10.62,;23.6,-11.21,;23.79,-12.74,;25.21,-13.33,;24.82,-10.28,;24.63,-8.75,;26.24,-10.88,;27.46,-9.94,;27.27,-8.41,;28.48,-7.48,;28.29,-5.95,;29.91,-8.07,;28.89,-10.53,;30.11,-9.6,;29.08,-12.06,;27.95,-13.3,;28.78,-14.76,;30.42,-14.43,;30.34,-12.88,;31.67,-12.12,;31.67,-10.57,;32.99,-12.88,;33.75,-14.22,;35.28,-14.25,;36.03,-15.61,;37.56,-15.63,;38.31,-16.97,;39.85,-17,;40.63,-15.69,;40.6,-18.35,;32.95,-15.55,;31.41,-15.52,;33.69,-16.89,)|
Show InChI InChI=1S/C52H78N20O15S4/c1-24-41(78)66-30(15-25-18-61-27-8-3-2-7-26(25)27)44(81)64-28(9-4-12-59-51(55)56)42(79)69-33(40(54)77)20-88-90-23-36-48(85)68-32(19-73)45(82)67-31(16-39(75)76)50(87)72-14-6-11-37(72)49(86)65-29(10-5-13-60-52(57)58)43(80)70-35(46(83)62-24)22-91-89-21-34(47(84)71-36)63-38(74)17-53/h2-3,7-8,18,24,28-37,61,73H,4-6,9-17,19-23,53H2,1H3,(H2,54,77)(H,62,83)(H,63,74)(H,64,81)(H,65,86)(H,66,78)(H,67,82)(H,68,85)(H,69,79)(H,70,80)(H,71,84)(H,75,76)(H4,55,56,59)(H4,57,58,60)/t24-,28-,29-,30-,31-,32-,33-,34-,35-,36-,37-/m0/s1
n/an/a 3.39E+3n/an/an/an/an/an/a
Hainan University
Curated by ChEMBL
Assay Description
Inhibition of human alpha3beta4 nAChR
J Med Chem 56: 9655-63 (2014)
Article DOI: 10.1021/jm401254c
BindingDB Entry DOI: 10.7270/Q22Z171M
Neuronal acetylcholine receptor subunit alpha-10/alpha-9
(Homo sapiens (Human))
BDBM50445329
(CHEMBL3104242)
Show SMILES C[C@@H]1NC(=O)[C@@H]2CSSC[C@H](NC(=O)CN)C(=O)N[C@@H](CSSC[C@H](NC(=O)[C@H](CCCN=C(N)N)NC(=O)[C@H](Cc3c[nH]c4ccccc34)NC1=O)C(N)=O)C(=O)N[C@@H](CO)C(=O)N[C@@H](CC(O)=O)C(=O)N1CCC[C@H]1C(=O)N[C@@H](CCCN=C(N)N)C(=O)N2 |r,wU:65.68,80.84,1.0,39.39,28.28,wD:10.10,19.18,59.62,76.79,5.94,24.55,(35.13,-22.24,;33.59,-22.21,;32.85,-20.87,;33.65,-19.55,;35.17,-19.58,;32.9,-18.21,;31.36,-18.18,;30.57,-19.5,;15.44,-12.7,;16.79,-10.97,;16.78,-9.44,;15.44,-8.69,;14.12,-9.46,;14.14,-11,;12.78,-8.7,;11.45,-9.48,;18.11,-8.65,;18.1,-7.11,;19.45,-9.41,;19.5,-10.96,;18.18,-11.74,;18.2,-13.29,;23.43,-23.77,;24.75,-24.55,;24.72,-26.1,;26.05,-26.89,;27.39,-26.14,;27.41,-24.59,;28.72,-26.93,;28.7,-28.46,;27.35,-29.21,;27.33,-30.75,;25.99,-31.5,;25.97,-33.04,;27.29,-33.82,;24.63,-33.8,;30.06,-26.18,;31.38,-26.96,;31.36,-28.5,;32.74,-26.19,;33.8,-27.31,;35.29,-26.94,;35.88,-25.53,;37.41,-25.64,;37.78,-27.14,;39.13,-27.86,;39.17,-29.39,;37.86,-30.21,;36.52,-29.47,;36.48,-27.94,;33.54,-24.89,;32.8,-23.55,;31.25,-23.52,;23.39,-26.85,;22.06,-26.06,;23.36,-28.38,;20.95,-11.55,;21.14,-13.08,;22.18,-10.62,;23.6,-11.21,;23.79,-12.74,;25.21,-13.33,;24.82,-10.28,;24.63,-8.75,;26.24,-10.88,;27.46,-9.94,;27.27,-8.41,;28.48,-7.48,;28.29,-5.95,;29.91,-8.07,;28.89,-10.53,;30.11,-9.6,;29.08,-12.06,;27.95,-13.3,;28.78,-14.76,;30.42,-14.43,;30.34,-12.88,;31.67,-12.12,;31.67,-10.57,;32.99,-12.88,;33.75,-14.22,;35.28,-14.25,;36.03,-15.61,;37.56,-15.63,;38.31,-16.97,;39.85,-17,;40.63,-15.69,;40.6,-18.35,;32.95,-15.55,;31.41,-15.52,;33.69,-16.89,)|
Show InChI InChI=1S/C52H78N20O15S4/c1-24-41(78)66-30(15-25-18-61-27-8-3-2-7-26(25)27)44(81)64-28(9-4-12-59-51(55)56)42(79)69-33(40(54)77)20-88-90-23-36-48(85)68-32(19-73)45(82)67-31(16-39(75)76)50(87)72-14-6-11-37(72)49(86)65-29(10-5-13-60-52(57)58)43(80)70-35(46(83)62-24)22-91-89-21-34(47(84)71-36)63-38(74)17-53/h2-3,7-8,18,24,28-37,61,73H,4-6,9-17,19-23,53H2,1H3,(H2,54,77)(H,62,83)(H,63,74)(H,64,81)(H,65,86)(H,66,78)(H,67,82)(H,68,85)(H,69,79)(H,70,80)(H,71,84)(H,75,76)(H4,55,56,59)(H4,57,58,60)/t24-,28-,29-,30-,31-,32-,33-,34-,35-,36-,37-/m0/s1
n/an/a 2.00E+3n/an/an/an/an/an/a
Hainan University
Curated by ChEMBL
Assay Description
Inhibition of human alpha9alpha10 nAChR
J Med Chem 56: 9655-63 (2014)
Article DOI: 10.1021/jm401254c
BindingDB Entry DOI: 10.7270/Q22Z171M
Neuronal acetylcholine receptor subunit alpha-7
(Homo sapiens (Human))
BDBM50445329
(CHEMBL3104242)
Show SMILES C[C@@H]1NC(=O)[C@@H]2CSSC[C@H](NC(=O)CN)C(=O)N[C@@H](CSSC[C@H](NC(=O)[C@H](CCCN=C(N)N)NC(=O)[C@H](Cc3c[nH]c4ccccc34)NC1=O)C(N)=O)C(=O)N[C@@H](CO)C(=O)N[C@@H](CC(O)=O)C(=O)N1CCC[C@H]1C(=O)N[C@@H](CCCN=C(N)N)C(=O)N2 |r,wU:65.68,80.84,1.0,39.39,28.28,wD:10.10,19.18,59.62,76.79,5.94,24.55,(35.13,-22.24,;33.59,-22.21,;32.85,-20.87,;33.65,-19.55,;35.17,-19.58,;32.9,-18.21,;31.36,-18.18,;30.57,-19.5,;15.44,-12.7,;16.79,-10.97,;16.78,-9.44,;15.44,-8.69,;14.12,-9.46,;14.14,-11,;12.78,-8.7,;11.45,-9.48,;18.11,-8.65,;18.1,-7.11,;19.45,-9.41,;19.5,-10.96,;18.18,-11.74,;18.2,-13.29,;23.43,-23.77,;24.75,-24.55,;24.72,-26.1,;26.05,-26.89,;27.39,-26.14,;27.41,-24.59,;28.72,-26.93,;28.7,-28.46,;27.35,-29.21,;27.33,-30.75,;25.99,-31.5,;25.97,-33.04,;27.29,-33.82,;24.63,-33.8,;30.06,-26.18,;31.38,-26.96,;31.36,-28.5,;32.74,-26.19,;33.8,-27.31,;35.29,-26.94,;35.88,-25.53,;37.41,-25.64,;37.78,-27.14,;39.13,-27.86,;39.17,-29.39,;37.86,-30.21,;36.52,-29.47,;36.48,-27.94,;33.54,-24.89,;32.8,-23.55,;31.25,-23.52,;23.39,-26.85,;22.06,-26.06,;23.36,-28.38,;20.95,-11.55,;21.14,-13.08,;22.18,-10.62,;23.6,-11.21,;23.79,-12.74,;25.21,-13.33,;24.82,-10.28,;24.63,-8.75,;26.24,-10.88,;27.46,-9.94,;27.27,-8.41,;28.48,-7.48,;28.29,-5.95,;29.91,-8.07,;28.89,-10.53,;30.11,-9.6,;29.08,-12.06,;27.95,-13.3,;28.78,-14.76,;30.42,-14.43,;30.34,-12.88,;31.67,-12.12,;31.67,-10.57,;32.99,-12.88,;33.75,-14.22,;35.28,-14.25,;36.03,-15.61,;37.56,-15.63,;38.31,-16.97,;39.85,-17,;40.63,-15.69,;40.6,-18.35,;32.95,-15.55,;31.41,-15.52,;33.69,-16.89,)|
Show InChI InChI=1S/C52H78N20O15S4/c1-24-41(78)66-30(15-25-18-61-27-8-3-2-7-26(25)27)44(81)64-28(9-4-12-59-51(55)56)42(79)69-33(40(54)77)20-88-90-23-36-48(85)68-32(19-73)45(82)67-31(16-39(75)76)50(87)72-14-6-11-37(72)49(86)65-29(10-5-13-60-52(57)58)43(80)70-35(46(83)62-24)22-91-89-21-34(47(84)71-36)63-38(74)17-53/h2-3,7-8,18,24,28-37,61,73H,4-6,9-17,19-23,53H2,1H3,(H2,54,77)(H,62,83)(H,63,74)(H,64,81)(H,65,86)(H,66,78)(H,67,82)(H,68,85)(H,69,79)(H,70,80)(H,71,84)(H,75,76)(H4,55,56,59)(H4,57,58,60)/t24-,28-,29-,30-,31-,32-,33-,34-,35-,36-,37-/m0/s1
n/an/a 497n/an/an/an/an/an/a
Hainan University
Curated by ChEMBL
Assay Description
Antagonist activity at human alpha7 nAChR expressed in Xenopus laevis oocytes assessed as inhibition of Ach-induced response at -80 mV holding potent...
J Med Chem 63: 1564-1575 (2020)
Article DOI: 10.1021/acs.jmedchem.9b01409
Neuronal acetylcholine receptor subunit alpha-3/beta-2
(Homo sapiens (Human))
BDBM50445329
(CHEMBL3104242)
Show SMILES C[C@@H]1NC(=O)[C@@H]2CSSC[C@H](NC(=O)CN)C(=O)N[C@@H](CSSC[C@H](NC(=O)[C@H](CCCN=C(N)N)NC(=O)[C@H](Cc3c[nH]c4ccccc34)NC1=O)C(N)=O)C(=O)N[C@@H](CO)C(=O)N[C@@H](CC(O)=O)C(=O)N1CCC[C@H]1C(=O)N[C@@H](CCCN=C(N)N)C(=O)N2 |r,wU:65.68,80.84,1.0,39.39,28.28,wD:10.10,19.18,59.62,76.79,5.94,24.55,(35.13,-22.24,;33.59,-22.21,;32.85,-20.87,;33.65,-19.55,;35.17,-19.58,;32.9,-18.21,;31.36,-18.18,;30.57,-19.5,;15.44,-12.7,;16.79,-10.97,;16.78,-9.44,;15.44,-8.69,;14.12,-9.46,;14.14,-11,;12.78,-8.7,;11.45,-9.48,;18.11,-8.65,;18.1,-7.11,;19.45,-9.41,;19.5,-10.96,;18.18,-11.74,;18.2,-13.29,;23.43,-23.77,;24.75,-24.55,;24.72,-26.1,;26.05,-26.89,;27.39,-26.14,;27.41,-24.59,;28.72,-26.93,;28.7,-28.46,;27.35,-29.21,;27.33,-30.75,;25.99,-31.5,;25.97,-33.04,;27.29,-33.82,;24.63,-33.8,;30.06,-26.18,;31.38,-26.96,;31.36,-28.5,;32.74,-26.19,;33.8,-27.31,;35.29,-26.94,;35.88,-25.53,;37.41,-25.64,;37.78,-27.14,;39.13,-27.86,;39.17,-29.39,;37.86,-30.21,;36.52,-29.47,;36.48,-27.94,;33.54,-24.89,;32.8,-23.55,;31.25,-23.52,;23.39,-26.85,;22.06,-26.06,;23.36,-28.38,;20.95,-11.55,;21.14,-13.08,;22.18,-10.62,;23.6,-11.21,;23.79,-12.74,;25.21,-13.33,;24.82,-10.28,;24.63,-8.75,;26.24,-10.88,;27.46,-9.94,;27.27,-8.41,;28.48,-7.48,;28.29,-5.95,;29.91,-8.07,;28.89,-10.53,;30.11,-9.6,;29.08,-12.06,;27.95,-13.3,;28.78,-14.76,;30.42,-14.43,;30.34,-12.88,;31.67,-12.12,;31.67,-10.57,;32.99,-12.88,;33.75,-14.22,;35.28,-14.25,;36.03,-15.61,;37.56,-15.63,;38.31,-16.97,;39.85,-17,;40.63,-15.69,;40.6,-18.35,;32.95,-15.55,;31.41,-15.52,;33.69,-16.89,)|
Show InChI InChI=1S/C52H78N20O15S4/c1-24-41(78)66-30(15-25-18-61-27-8-3-2-7-26(25)27)44(81)64-28(9-4-12-59-51(55)56)42(79)69-33(40(54)77)20-88-90-23-36-48(85)68-32(19-73)45(82)67-31(16-39(75)76)50(87)72-14-6-11-37(72)49(86)65-29(10-5-13-60-52(57)58)43(80)70-35(46(83)62-24)22-91-89-21-34(47(84)71-36)63-38(74)17-53/h2-3,7-8,18,24,28-37,61,73H,4-6,9-17,19-23,53H2,1H3,(H2,54,77)(H,62,83)(H,63,74)(H,64,81)(H,65,86)(H,66,78)(H,67,82)(H,68,85)(H,69,79)(H,70,80)(H,71,84)(H,75,76)(H4,55,56,59)(H4,57,58,60)/t24-,28-,29-,30-,31-,32-,33-,34-,35-,36-,37-/m0/s1
n/an/a 41n/an/an/an/an/an/a
Hainan University
Curated by ChEMBL
Assay Description
Inhibition of human alpha3beta2 nAChR
J Med Chem 56: 9655-63 (2014)
Article DOI: 10.1021/jm401254c
BindingDB Entry DOI: 10.7270/Q22Z171M
Neuronal acetylcholine receptor subunit alpha-7
(Homo sapiens (Human))
BDBM50445329
(CHEMBL3104242)
Show SMILES C[C@@H]1NC(=O)[C@@H]2CSSC[C@H](NC(=O)CN)C(=O)N[C@@H](CSSC[C@H](NC(=O)[C@H](CCCN=C(N)N)NC(=O)[C@H](Cc3c[nH]c4ccccc34)NC1=O)C(N)=O)C(=O)N[C@@H](CO)C(=O)N[C@@H](CC(O)=O)C(=O)N1CCC[C@H]1C(=O)N[C@@H](CCCN=C(N)N)C(=O)N2 |r,wU:65.68,80.84,1.0,39.39,28.28,wD:10.10,19.18,59.62,76.79,5.94,24.55,(35.13,-22.24,;33.59,-22.21,;32.85,-20.87,;33.65,-19.55,;35.17,-19.58,;32.9,-18.21,;31.36,-18.18,;30.57,-19.5,;15.44,-12.7,;16.79,-10.97,;16.78,-9.44,;15.44,-8.69,;14.12,-9.46,;14.14,-11,;12.78,-8.7,;11.45,-9.48,;18.11,-8.65,;18.1,-7.11,;19.45,-9.41,;19.5,-10.96,;18.18,-11.74,;18.2,-13.29,;23.43,-23.77,;24.75,-24.55,;24.72,-26.1,;26.05,-26.89,;27.39,-26.14,;27.41,-24.59,;28.72,-26.93,;28.7,-28.46,;27.35,-29.21,;27.33,-30.75,;25.99,-31.5,;25.97,-33.04,;27.29,-33.82,;24.63,-33.8,;30.06,-26.18,;31.38,-26.96,;31.36,-28.5,;32.74,-26.19,;33.8,-27.31,;35.29,-26.94,;35.88,-25.53,;37.41,-25.64,;37.78,-27.14,;39.13,-27.86,;39.17,-29.39,;37.86,-30.21,;36.52,-29.47,;36.48,-27.94,;33.54,-24.89,;32.8,-23.55,;31.25,-23.52,;23.39,-26.85,;22.06,-26.06,;23.36,-28.38,;20.95,-11.55,;21.14,-13.08,;22.18,-10.62,;23.6,-11.21,;23.79,-12.74,;25.21,-13.33,;24.82,-10.28,;24.63,-8.75,;26.24,-10.88,;27.46,-9.94,;27.27,-8.41,;28.48,-7.48,;28.29,-5.95,;29.91,-8.07,;28.89,-10.53,;30.11,-9.6,;29.08,-12.06,;27.95,-13.3,;28.78,-14.76,;30.42,-14.43,;30.34,-12.88,;31.67,-12.12,;31.67,-10.57,;32.99,-12.88,;33.75,-14.22,;35.28,-14.25,;36.03,-15.61,;37.56,-15.63,;38.31,-16.97,;39.85,-17,;40.63,-15.69,;40.6,-18.35,;32.95,-15.55,;31.41,-15.52,;33.69,-16.89,)|
Show InChI InChI=1S/C52H78N20O15S4/c1-24-41(78)66-30(15-25-18-61-27-8-3-2-7-26(25)27)44(81)64-28(9-4-12-59-51(55)56)42(79)69-33(40(54)77)20-88-90-23-36-48(85)68-32(19-73)45(82)67-31(16-39(75)76)50(87)72-14-6-11-37(72)49(86)65-29(10-5-13-60-52(57)58)43(80)70-35(46(83)62-24)22-91-89-21-34(47(84)71-36)63-38(74)17-53/h2-3,7-8,18,24,28-37,61,73H,4-6,9-17,19-23,53H2,1H3,(H2,54,77)(H,62,83)(H,63,74)(H,64,81)(H,65,86)(H,66,78)(H,67,82)(H,68,85)(H,69,79)(H,70,80)(H,71,84)(H,75,76)(H4,55,56,59)(H4,57,58,60)/t24-,28-,29-,30-,31-,32-,33-,34-,35-,36-,37-/m0/s1
n/an/a 1.00E+3n/an/an/an/an/an/a
Ocean University of China
Curated by ChEMBL
Assay Description
Inhibition of human alpha7 nAChR expressed in Xenopus laevis oocytes assessed as inhibition of ACh-evoked currents by two-electrode voltage clamp ass...
J Med Chem 63: 2974-2985 (2020)
Article DOI: 10.1021/acs.jmedchem.9b01536
Neuronal acetylcholine receptor subunit alpha-7
(Homo sapiens (Human))
BDBM50445329
(CHEMBL3104242)
Show SMILES C[C@@H]1NC(=O)[C@@H]2CSSC[C@H](NC(=O)CN)C(=O)N[C@@H](CSSC[C@H](NC(=O)[C@H](CCCN=C(N)N)NC(=O)[C@H](Cc3c[nH]c4ccccc34)NC1=O)C(N)=O)C(=O)N[C@@H](CO)C(=O)N[C@@H](CC(O)=O)C(=O)N1CCC[C@H]1C(=O)N[C@@H](CCCN=C(N)N)C(=O)N2 |r,wU:65.68,80.84,1.0,39.39,28.28,wD:10.10,19.18,59.62,76.79,5.94,24.55,(35.13,-22.24,;33.59,-22.21,;32.85,-20.87,;33.65,-19.55,;35.17,-19.58,;32.9,-18.21,;31.36,-18.18,;30.57,-19.5,;15.44,-12.7,;16.79,-10.97,;16.78,-9.44,;15.44,-8.69,;14.12,-9.46,;14.14,-11,;12.78,-8.7,;11.45,-9.48,;18.11,-8.65,;18.1,-7.11,;19.45,-9.41,;19.5,-10.96,;18.18,-11.74,;18.2,-13.29,;23.43,-23.77,;24.75,-24.55,;24.72,-26.1,;26.05,-26.89,;27.39,-26.14,;27.41,-24.59,;28.72,-26.93,;28.7,-28.46,;27.35,-29.21,;27.33,-30.75,;25.99,-31.5,;25.97,-33.04,;27.29,-33.82,;24.63,-33.8,;30.06,-26.18,;31.38,-26.96,;31.36,-28.5,;32.74,-26.19,;33.8,-27.31,;35.29,-26.94,;35.88,-25.53,;37.41,-25.64,;37.78,-27.14,;39.13,-27.86,;39.17,-29.39,;37.86,-30.21,;36.52,-29.47,;36.48,-27.94,;33.54,-24.89,;32.8,-23.55,;31.25,-23.52,;23.39,-26.85,;22.06,-26.06,;23.36,-28.38,;20.95,-11.55,;21.14,-13.08,;22.18,-10.62,;23.6,-11.21,;23.79,-12.74,;25.21,-13.33,;24.82,-10.28,;24.63,-8.75,;26.24,-10.88,;27.46,-9.94,;27.27,-8.41,;28.48,-7.48,;28.29,-5.95,;29.91,-8.07,;28.89,-10.53,;30.11,-9.6,;29.08,-12.06,;27.95,-13.3,;28.78,-14.76,;30.42,-14.43,;30.34,-12.88,;31.67,-12.12,;31.67,-10.57,;32.99,-12.88,;33.75,-14.22,;35.28,-14.25,;36.03,-15.61,;37.56,-15.63,;38.31,-16.97,;39.85,-17,;40.63,-15.69,;40.6,-18.35,;32.95,-15.55,;31.41,-15.52,;33.69,-16.89,)|
Show InChI InChI=1S/C52H78N20O15S4/c1-24-41(78)66-30(15-25-18-61-27-8-3-2-7-26(25)27)44(81)64-28(9-4-12-59-51(55)56)42(79)69-33(40(54)77)20-88-90-23-36-48(85)68-32(19-73)45(82)67-31(16-39(75)76)50(87)72-14-6-11-37(72)49(86)65-29(10-5-13-60-52(57)58)43(80)70-35(46(83)62-24)22-91-89-21-34(47(84)71-36)63-38(74)17-53/h2-3,7-8,18,24,28-37,61,73H,4-6,9-17,19-23,53H2,1H3,(H2,54,77)(H,62,83)(H,63,74)(H,64,81)(H,65,86)(H,66,78)(H,67,82)(H,68,85)(H,69,79)(H,70,80)(H,71,84)(H,75,76)(H4,55,56,59)(H4,57,58,60)/t24-,28-,29-,30-,31-,32-,33-,34-,35-,36-,37-/m0/s1
n/an/a 595n/an/an/an/an/an/a
Hainan University
Curated by ChEMBL
Assay Description
Inhibition of human alpha7 nAChR
J Med Chem 56: 9655-63 (2014)
Article DOI: 10.1021/jm401254c
BindingDB Entry DOI: 10.7270/Q22Z171M