BDBM50445342 CHEMBL199600
SMILES: Oc1ccc(cc1)C(=O)NN=Cc1ccccc1O
InChI Key: InChIKey=KBVOYZBDPPDBHJ-UHFFFAOYSA-N
Data: 1 IC50
Activity Spreadsheet -- Enzyme Inhibition Constant Data from BindingDB
Found 1 hit for monomerid = 50445342
Trg + Lig
Ki
nM
ΔG°
kcal/mole
IC50
nM
Kd
nM
EC50/IC50
nM
koff
s-1
kon
M-1s-1
pHTemp
°C
Lysine-specific histone demethylase 1A
(Homo sapiens (Human))
BDBM50445342
(CHEMBL199600)
Show SMILES Oc1ccc(cc1)C(=O)NN=Cc1ccccc1O |w:11.12|
Show InChI InChI=1S/C14H12N2O3/c17-12-7-5-10(6-8-12)14(19)16-15-9-11-3-1-2-4-13(11)18/h1-9,17-18H,(H,16,19)
Reactome pathway
n/an/a 218n/an/an/an/an/an/a
University of Utah
Curated by ChEMBL
Assay Description
Inhibition of LSD1 (unknown origin) using dimethyl K4 peptide as substrate assessed as resorufin level by spectrophotometric analysis
J Med Chem 56: 9496-508 (2014)
Article DOI: 10.1021/jm400870h
BindingDB Entry DOI: 10.7270/Q2Z60QJ7