BDBM50445344 CHEMBL3104249
SMILES: CC(=NNC(=O)c1ccccc1)c1cc(Cl)ccc1O
InChI Key: InChIKey=ZQAYLTHKLYBTAW-UHFFFAOYSA-N
Data: 1 IC50
Activity Spreadsheet -- Enzyme Inhibition Constant Data from BindingDB
Found 1 hit for monomerid = 50445344
Trg + Lig
Ki
nM
ΔG°
kcal/mole
IC50
nM
Kd
nM
EC50/IC50
nM
koff
s-1
kon
M-1s-1
pHTemp
°C
Lysine-specific histone demethylase 1A
(Homo sapiens (Human))
BDBM50445344
(CHEMBL3104249)
Show SMILES CC(=NNC(=O)c1ccccc1)c1cc(Cl)ccc1O |w:2.2|
Show InChI InChI=1S/C15H13ClN2O2/c1-10(13-9-12(16)7-8-14(13)19)17-18-15(20)11-5-3-2-4-6-11/h2-9,19H,1H3,(H,18,20)
Reactome pathway
n/an/a 128n/an/an/an/an/an/a
University of Utah
Curated by ChEMBL
Assay Description
Inhibition of LSD1 (unknown origin) using dimethyl K4 peptide as substrate assessed as resorufin level by spectrophotometric analysis
J Med Chem 56: 9496-508 (2014)
Article DOI: 10.1021/jm400870h
BindingDB Entry DOI: 10.7270/Q2Z60QJ7