BDBM50445352 CHEMBL1086207
SMILES: S=C(NCCCNCCCCCCCNCCCNC(=S)NCC(c1ccccc1)c1ccccc1)NCC(c1ccccc1)c1ccccc1
InChI Key: InChIKey=USQQTBMBRTXUNT-UHFFFAOYSA-N
Data: 1 IC50
Activity Spreadsheet -- Enzyme Inhibition Constant Data from BindingDB
Found 1 hit for monomerid = 50445352
Trg + Lig
Ki
nM
ΔG°
kcal/mole
IC50
nM
Kd
nM
EC50/IC50
nM
koff
s-1
kon
M-1s-1
pHTemp
°C
Lysine-specific histone demethylase 1A
(Homo sapiens (Human))
BDBM50445352
(CHEMBL1086207)
Show SMILES S=C(NCCCNCCCCCCCNCCCNC(=S)NCC(c1ccccc1)c1ccccc1)NCC(c1ccccc1)c1ccccc1
Show InChI InChI=1S/C43H58N6S2/c50-42(48-34-40(36-20-8-4-9-21-36)37-22-10-5-11-23-37)46-32-18-30-44-28-16-2-1-3-17-29-45-31-19-33-47-43(51)49-35-41(38-24-12-6-13-25-38)39-26-14-7-15-27-39/h4-15,20-27,40-41,44-45H,1-3,16-19,28-35H2,(H2,46,48,50)(H2,47,49,51)
Reactome pathway
n/an/a 1.95E+4n/an/an/an/an/an/a
University of Utah
Curated by ChEMBL
Assay Description
Inhibition of human recombinant LSD1 expressed in Escherichia coli BL21(DE3) using H3K4me2 as substrate by chemiluminescence assay
J Med Chem 56: 9496-508 (2014)
Article DOI: 10.1021/jm400870h
BindingDB Entry DOI: 10.7270/Q2Z60QJ7