BDBM50445361 CHEMBL3104255
SMILES: CC(=NNC(=O)c1ccccc1)c1c(O)cccc1O
InChI Key: InChIKey=FVMVQSIVQIYRRI-UHFFFAOYSA-N
Data: 1 IC50
Activity Spreadsheet -- Enzyme Inhibition Constant Data from BindingDB
Found 1 hit for monomerid = 50445361
Trg + Lig
Ki
nM
ΔG°
kcal/mole
IC50
nM
Kd
nM
EC50/IC50
nM
koff
s-1
kon
M-1s-1
pHTemp
°C
Lysine-specific histone demethylase 1A
(Homo sapiens (Human))
BDBM50445361
(CHEMBL3104255)
Show SMILES CC(=NNC(=O)c1ccccc1)c1c(O)cccc1O |w:2.2|
Show InChI InChI=1S/C15H14N2O3/c1-10(14-12(18)8-5-9-13(14)19)16-17-15(20)11-6-3-2-4-7-11/h2-9,18-19H,1H3,(H,17,20)
Reactome pathway
n/an/a>3.00E+3n/an/an/an/an/an/a
University of Utah
Curated by ChEMBL
Assay Description
Inhibition of LSD1 (unknown origin) using dimethyl K4 peptide as substrate assessed as resorufin level by spectrophotometric analysis
J Med Chem 56: 9496-508 (2014)
Article DOI: 10.1021/jm400870h
BindingDB Entry DOI: 10.7270/Q2Z60QJ7