BDBM50445595 CHEMBL3103453
SMILES: ONC(=O)CC(CCOCCc1ccc(F)cc1)c1ccc(Cl)cc1Cl
InChI Key: InChIKey=XQHQHZCIBXCRJA-UHFFFAOYSA-N
Data: 1 KI  1 IC50
Activity Spreadsheet -- Enzyme Inhibition Constant Data from BindingDB
Found 2 hits for monomerid = 50445595
Trg + Lig
Ki
nM
ΔG°
kcal/mole
IC50
nM
Kd
nM
EC50/IC50
nM
koff
s-1
kon
M-1s-1
pHTemp
°C
Botulinum neurotoxin type A
(Clostridium botulinum)
BDBM50445595
(CHEMBL3103453)
Show SMILES ONC(=O)CC(CCOCCc1ccc(F)cc1)c1ccc(Cl)cc1Cl
Show InChI InChI=1S/C19H20Cl2FNO3/c20-15-3-6-17(18(21)12-15)14(11-19(24)23-25)8-10-26-9-7-13-1-4-16(22)5-2-13/h1-6,12,14,25H,7-11H2,(H,23,24)
NCI pathway
Reactome pathway
2.10E+3n/an/an/an/an/an/an/an/a
The Scripps Research Institute
Curated by ChEMBL
Assay Description
Inhibition of Clostridium botulinum BoNT/A light chain (1 to 425 amino acids) by LC-MS analysis
Bioorg Med Chem 22: 1208-17 (2014)
Article DOI: 10.1016/j.bmc.2013.11.053
BindingDB Entry DOI: 10.7270/Q2W66N71
Botulinum neurotoxin type A
(Clostridium botulinum)
BDBM50445595
(CHEMBL3103453)
Show SMILES ONC(=O)CC(CCOCCc1ccc(F)cc1)c1ccc(Cl)cc1Cl
Show InChI InChI=1S/C19H20Cl2FNO3/c20-15-3-6-17(18(21)12-15)14(11-19(24)23-25)8-10-26-9-7-13-1-4-16(22)5-2-13/h1-6,12,14,25H,7-11H2,(H,23,24)
NCI pathway
Reactome pathway
n/an/a 970n/an/an/an/an/an/a
The Scripps Research Institute
Curated by ChEMBL
Assay Description
Inhibition of Clostridium botulinum BoNT/A light chain (1 to 425 amino acids) by FRET method
Bioorg Med Chem 22: 1208-17 (2014)
Article DOI: 10.1016/j.bmc.2013.11.053
BindingDB Entry DOI: 10.7270/Q2W66N71