BDBM50445711 CHEMBL3104321
SMILES: COc1ccccc1\C=C1/CNCC2=C1N=C1SC=C(N1C2c1ccccc1OC)c1ccc(F)cc1
InChI Key: InChIKey=FVKWBAHPUAWUCW-RCCKNPSSSA-N
Data: 2 IC50
Activity Spreadsheet -- Enzyme Inhibition Constant Data from BindingDB
Found 2 hits for monomerid = 50445711
Trg + Lig
Ki
nM
ΔG°
kcal/mole
IC50
nM
Kd
nM
EC50/IC50
nM
koff
s-1
kon
M-1s-1
pHTemp
°C
Acetylcholinesterase
(Electrophorus electricus (Electric eel))
BDBM50445711
(CHEMBL3104321)
Show SMILES COc1ccccc1\C=C1/CNCC2=C1N=C1SC=C(N1C2c1ccccc1OC)c1ccc(F)cc1 |c:14,20,t:17|
Show InChI InChI=1S/C30H26FN3O2S/c1-35-26-9-5-3-7-20(26)15-21-16-32-17-24-28(21)33-30-34(29(24)23-8-4-6-10-27(23)36-2)25(18-37-30)19-11-13-22(31)14-12-19/h3-15,18,29,32H,16-17H2,1-2H3/b21-15+
n/an/a 5.50E+3n/an/an/an/an/an/a
Universiti Sains Malaysia
Curated by ChEMBL
Assay Description
Inhibition of Electrophorus electricus acetylcholinesterase using acetylthiocholine iodide as substrate preincubated for 15 mins followed by substrat...
Bioorg Med Chem 22: 906-16 (2014)
Article DOI: 10.1016/j.bmc.2013.11.020
BindingDB Entry DOI: 10.7270/Q23R0VBZ
Butyrylcholinesterase (BuChE)
(Equus caballus (Horse))
BDBM50445711
(CHEMBL3104321)
Show SMILES COc1ccccc1\C=C1/CNCC2=C1N=C1SC=C(N1C2c1ccccc1OC)c1ccc(F)cc1 |c:14,20,t:17|
Show InChI InChI=1S/C30H26FN3O2S/c1-35-26-9-5-3-7-20(26)15-21-16-32-17-24-28(21)33-30-34(29(24)23-8-4-6-10-27(23)36-2)25(18-37-30)19-11-13-22(31)14-12-19/h3-15,18,29,32H,16-17H2,1-2H3/b21-15+
n/an/a 8.75E+3n/an/an/an/an/an/a
Universiti Sains Malaysia
Curated by ChEMBL
Assay Description
Inhibition of equine serum butyrylcholinesterase using S-butyrylthiocholine chloride as substrate preincubated for 15 mins followed by substrate addi...
Bioorg Med Chem 22: 906-16 (2014)
Article DOI: 10.1016/j.bmc.2013.11.020
BindingDB Entry DOI: 10.7270/Q23R0VBZ