BDBM50445714 CHEMBL3104319
SMILES: Fc1ccc(\C=C2/CNCC3=C2N=C2SC=C(N2C3c2ccc(F)cc2)c2ccccc2)cc1
InChI Key: InChIKey=OHNVVKMOCYXIGD-KGENOOAVSA-N
Data: 2 IC50
Activity Spreadsheet -- Enzyme Inhibition Constant Data from BindingDB
Found 2 hits for monomerid = 50445714
Trg + Lig
Ki
nM
ΔG°
kcal/mole
IC50
nM
Kd
nM
EC50/IC50
nM
koff
s-1
kon
M-1s-1
pHTemp
°C
Acetylcholinesterase
(Electrophorus electricus (Electric eel))
BDBM50445714
(CHEMBL3104319)
Show SMILES Fc1ccc(\C=C2/CNCC3=C2N=C2SC=C(N2C3c2ccc(F)cc2)c2ccccc2)cc1 |c:10,16,t:13|
Show InChI InChI=1S/C28H21F2N3S/c29-22-10-6-18(7-11-22)14-21-15-31-16-24-26(21)32-28-33(27(24)20-8-12-23(30)13-9-20)25(17-34-28)19-4-2-1-3-5-19/h1-14,17,27,31H,15-16H2/b21-14+
n/an/a 4.04E+3n/an/an/an/an/an/a
Universiti Sains Malaysia
Curated by ChEMBL
Assay Description
Inhibition of Electrophorus electricus acetylcholinesterase using acetylthiocholine iodide as substrate preincubated for 15 mins followed by substrat...
Bioorg Med Chem 22: 906-16 (2014)
Article DOI: 10.1016/j.bmc.2013.11.020
BindingDB Entry DOI: 10.7270/Q23R0VBZ
Butyrylcholinesterase (BuChE)
(Equus caballus (Horse))
BDBM50445714
(CHEMBL3104319)
Show SMILES Fc1ccc(\C=C2/CNCC3=C2N=C2SC=C(N2C3c2ccc(F)cc2)c2ccccc2)cc1 |c:10,16,t:13|
Show InChI InChI=1S/C28H21F2N3S/c29-22-10-6-18(7-11-22)14-21-15-31-16-24-26(21)32-28-33(27(24)20-8-12-23(30)13-9-20)25(17-34-28)19-4-2-1-3-5-19/h1-14,17,27,31H,15-16H2/b21-14+
n/an/a 3.95E+3n/an/an/an/an/an/a
Universiti Sains Malaysia
Curated by ChEMBL
Assay Description
Inhibition of equine serum butyrylcholinesterase using S-butyrylthiocholine chloride as substrate preincubated for 15 mins followed by substrate addi...
Bioorg Med Chem 22: 906-16 (2014)
Article DOI: 10.1016/j.bmc.2013.11.020
BindingDB Entry DOI: 10.7270/Q23R0VBZ