BDBM50445825 CHEMBL3105403
SMILES: O=C(CCc1nc2ccccc2c(=O)[nH]1)N1CCN(CC1)C(=O)c1ccc[nH]1
InChI Key: InChIKey=NLWNHSURVPSVNJ-UHFFFAOYSA-N
Data: 1 IC50  1 EC50
Activity Spreadsheet -- Enzyme Inhibition Constant Data from BindingDB
Found 2 hits for monomerid = 50445825
Trg + Lig
Ki
nM
ΔG°
kcal/mole
IC50
nM
Kd
nM
EC50/IC50
nM
koff
s-1
kon
M-1s-1
pHTemp
°C
Poly [ADP-ribose] polymerase 1
(Homo sapiens (Human))
BDBM50445825
(CHEMBL3105403)
Show SMILES O=C(CCc1nc2ccccc2c(=O)[nH]1)N1CCN(CC1)C(=O)c1ccc[nH]1
Show InChI InChI=1S/C20H21N5O3/c26-18(8-7-17-22-15-5-2-1-4-14(15)19(27)23-17)24-10-12-25(13-11-24)20(28)16-6-3-9-21-16/h1-6,9,21H,7-8,10-13H2,(H,22,23,27)
n/an/a 30n/an/an/an/an/an/a
R&D Sigma-Tau Industrie Farmaceutiche Riunite S.p.A.
Curated by ChEMBL
Assay Description
Inhibition of GST-tagged recombinant human PARP-1 expressed in Escherichia coli after 30 mins by fluorescence-based assay
Bioorg Med Chem Lett 24: 462-6 (2014)
Article DOI: 10.1016/j.bmcl.2013.12.048
BindingDB Entry DOI: 10.7270/Q26H4JV0
Poly [ADP-ribose] polymerase 1
(Homo sapiens (Human))
BDBM50445825
(CHEMBL3105403)
Show SMILES O=C(CCc1nc2ccccc2c(=O)[nH]1)N1CCN(CC1)C(=O)c1ccc[nH]1
Show InChI InChI=1S/C20H21N5O3/c26-18(8-7-17-22-15-5-2-1-4-14(15)19(27)23-17)24-10-12-25(13-11-24)20(28)16-6-3-9-21-16/h1-6,9,21H,7-8,10-13H2,(H,22,23,27)
n/an/an/an/a 865n/an/an/an/a
R&D Sigma-Tau Industrie Farmaceutiche Riunite S.p.A.
Curated by ChEMBL
Assay Description
Inhibition of PARP-1-mediated PARylation in H2O2-induced human HeLa cells preincubated for 3 hrs followed by H2O2 addition measured after 5 mins by D...
Bioorg Med Chem Lett 24: 462-6 (2014)
Article DOI: 10.1016/j.bmcl.2013.12.048
BindingDB Entry DOI: 10.7270/Q26H4JV0