BDBM50445992 CHEMBL3102861
SMILES: Oc1ccc2c(c[nH]c2c1)C(=O)C(=O)N1CCC(Cc2ccc(F)cc2)CC1
InChI Key: InChIKey=ZDHDPKMNZUENDO-UHFFFAOYSA-N
Data: 1 IC50
Activity Spreadsheet -- Enzyme Inhibition Constant Data from BindingDB
Found 1 hit for monomerid = 50445992
Trg + Lig
Ki
nM
ΔG°
kcal/mole
IC50
nM
Kd
nM
EC50/IC50
nM
koff
s-1
kon
M-1s-1
pHTemp
°C
Glutamate receptor ionotropic, NMDA 2B
(Rattus norvegicus (Rat))
BDBM50445992
(CHEMBL3102861)
Show SMILES Oc1ccc2c(c[nH]c2c1)C(=O)C(=O)N1CCC(Cc2ccc(F)cc2)CC1
Show InChI InChI=1S/C22H21FN2O3/c23-16-3-1-14(2-4-16)11-15-7-9-25(10-8-15)22(28)21(27)19-13-24-20-12-17(26)5-6-18(19)20/h1-6,12-13,15,24,26H,7-11H2
n/an/a 20n/an/an/an/an/an/a
Universit£ di Messina
Curated by ChEMBL
Assay Description
Displacement of [3H]Ifenprodil from NMDA receptor GluN2B subunit in Wistar rat cerebral cortex
Bioorg Med Chem 22: 1040-8 (2014)
Article DOI: 10.1016/j.bmc.2013.12.040
BindingDB Entry DOI: 10.7270/Q29888GS