null
SMILES: Brc1ccc(cc1)N1CCN(CC1)C(=O)N1CCOCC1
InChI Key: InChIKey=ZWNJUVJNMFWDPS-UHFFFAOYSA-N
Activity Spreadsheet -- Enzyme Inhibition Constant Data from BindingDB
Found 5 hits for monomerid = 50446018
Trg + Lig
Ki
nM
ΔG°
kcal/mole
IC50
nM
Kd
nM
EC50/IC50
nM
koff
s-1
kon
M-1s-1
pHTemp
°C
Aldo-keto reductase family 1 member C3
(Homo sapiens (Human))
BDBM50446018
(CHEMBL3103348)
Show SMILES Brc1ccc(cc1)N1CCN(CC1)C(=O)N1CCOCC1
Show InChI InChI=1S/C15H20BrN3O2/c16-13-1-3-14(4-2-13)17-5-7-18(8-6-17)15(20)19-9-11-21-12-10-19/h1-4H,5-12H2
n/an/a 12n/an/an/an/an/an/a
University of Auckland
Curated by ChEMBL
Assay Description
Inhibition of AKR1C3 (unknown origin) expressed in human HCT116 cells assessed as formation of PR-104H from PR-104A preincubated for 2 hrs
Bioorg Med Chem 22: 967-77 (2014)
Article DOI: 10.1016/j.bmc.2013.12.050
BindingDB Entry DOI: 10.7270/Q25H7HQM
Aldo-keto reductase family 1 member C4
(Homo sapiens (Human))
BDBM50446018
(CHEMBL3103348)
Show SMILES Brc1ccc(cc1)N1CCN(CC1)C(=O)N1CCOCC1
Show InChI InChI=1S/C15H20BrN3O2/c16-13-1-3-14(4-2-13)17-5-7-18(8-6-17)15(20)19-9-11-21-12-10-19/h1-4H,5-12H2
n/an/a>3.00E+4n/an/an/an/an/an/a
University of Auckland
Curated by ChEMBL
Assay Description
Inhibition of recombinant AKR1C4 (unknown origin) after 1 hr by competitive fluorescence assay
Bioorg Med Chem 22: 967-77 (2014)
Article DOI: 10.1016/j.bmc.2013.12.050
BindingDB Entry DOI: 10.7270/Q25H7HQM
Aldo-keto reductase family 1 member C1
(Homo sapiens (Human))
BDBM50446018
(CHEMBL3103348)
Show SMILES Brc1ccc(cc1)N1CCN(CC1)C(=O)N1CCOCC1
Show InChI InChI=1S/C15H20BrN3O2/c16-13-1-3-14(4-2-13)17-5-7-18(8-6-17)15(20)19-9-11-21-12-10-19/h1-4H,5-12H2
Reactome pathway
n/an/a>3.00E+4n/an/an/an/an/an/a
University of Auckland
Curated by ChEMBL
Assay Description
Inhibition of recombinant AKR1C1 (unknown origin) after 1 hr by competitive fluorescence assay
Bioorg Med Chem 22: 967-77 (2014)
Article DOI: 10.1016/j.bmc.2013.12.050
BindingDB Entry DOI: 10.7270/Q25H7HQM
Aldo-keto reductase family 1 member C2
(Homo sapiens (Human))
BDBM50446018
(CHEMBL3103348)
Show SMILES Brc1ccc(cc1)N1CCN(CC1)C(=O)N1CCOCC1
Show InChI InChI=1S/C15H20BrN3O2/c16-13-1-3-14(4-2-13)17-5-7-18(8-6-17)15(20)19-9-11-21-12-10-19/h1-4H,5-12H2
Reactome pathway
n/an/a>3.00E+4n/an/an/an/an/an/a
University of Auckland
Curated by ChEMBL
Assay Description
Inhibition of recombinant AKR1C2 (unknown origin) after 1 hr by competitive fluorescence assay
Bioorg Med Chem 22: 967-77 (2014)
Article DOI: 10.1016/j.bmc.2013.12.050
BindingDB Entry DOI: 10.7270/Q25H7HQM
Aldo-keto reductase family 1 member C3
(Homo sapiens (Human))
BDBM50446018
(CHEMBL3103348)
Show SMILES Brc1ccc(cc1)N1CCN(CC1)C(=O)N1CCOCC1
Show InChI InChI=1S/C15H20BrN3O2/c16-13-1-3-14(4-2-13)17-5-7-18(8-6-17)15(20)19-9-11-21-12-10-19/h1-4H,5-12H2
n/an/a 140n/an/an/an/an/an/a
University of Auckland
Curated by ChEMBL
Assay Description
Inhibition of recombinant AKR1C3 (unknown origin) after 1 hr by competitive fluorescence assay
Bioorg Med Chem 22: 967-77 (2014)
Article DOI: 10.1016/j.bmc.2013.12.050
BindingDB Entry DOI: 10.7270/Q25H7HQM