BDBM50446024 CHEMBL3103356
SMILES: [O-][N+](=O)c1ccc(cc1)N1CCN(CC1)C(=O)N1CCOCC1
InChI Key: InChIKey=QBXDVYMXHRSGQQ-UHFFFAOYSA-N
Data: 4 IC50
Activity Spreadsheet -- Enzyme Inhibition Constant Data from BindingDB
Found 4 hits for monomerid = 50446024
Trg + Lig
Ki
nM
ΔG°
kcal/mole
IC50
nM
Kd
nM
EC50/IC50
nM
koff
s-1
kon
M-1s-1
pHTemp
°C
Aldo-keto reductase family 1 member C4 (AK1C4)
(Homo sapiens (Human))
BDBM50446024
(CHEMBL3103356)
Show SMILES [O-][N+](=O)c1ccc(cc1)N1CCN(CC1)C(=O)N1CCOCC1
Show InChI InChI=1S/C15H20N4O4/c20-15(18-9-11-23-12-10-18)17-7-5-16(6-8-17)13-1-3-14(4-2-13)19(21)22/h1-4H,5-12H2
n/an/a>3.00E+4n/an/an/an/an/an/a
University of Auckland
Curated by ChEMBL
Assay Description
Inhibition of recombinant AKR1C4 (unknown origin) after 1 hr by competitive fluorescence assay
Bioorg Med Chem 22: 967-77 (2014)
Article DOI: 10.1016/j.bmc.2013.12.050
BindingDB Entry DOI: 10.7270/Q25H7HQM
Aldo-keto reductase family 1 member C1
(Homo sapiens (Human))
BDBM50446024
(CHEMBL3103356)
Show SMILES [O-][N+](=O)c1ccc(cc1)N1CCN(CC1)C(=O)N1CCOCC1
Show InChI InChI=1S/C15H20N4O4/c20-15(18-9-11-23-12-10-18)17-7-5-16(6-8-17)13-1-3-14(4-2-13)19(21)22/h1-4H,5-12H2
Reactome pathway
n/an/a>3.00E+4n/an/an/an/an/an/a
University of Auckland
Curated by ChEMBL
Assay Description
Inhibition of recombinant AKR1C1 (unknown origin) after 1 hr by competitive fluorescence assay
Bioorg Med Chem 22: 967-77 (2014)
Article DOI: 10.1016/j.bmc.2013.12.050
BindingDB Entry DOI: 10.7270/Q25H7HQM
Aldo-keto reductase family 1 member C2
(Homo sapiens (Human))
BDBM50446024
(CHEMBL3103356)
Show SMILES [O-][N+](=O)c1ccc(cc1)N1CCN(CC1)C(=O)N1CCOCC1
Show InChI InChI=1S/C15H20N4O4/c20-15(18-9-11-23-12-10-18)17-7-5-16(6-8-17)13-1-3-14(4-2-13)19(21)22/h1-4H,5-12H2
Reactome pathway
n/an/a>3.00E+4n/an/an/an/an/an/a
University of Auckland
Curated by ChEMBL
Assay Description
Inhibition of recombinant AKR1C2 (unknown origin) after 1 hr by competitive fluorescence assay
Bioorg Med Chem 22: 967-77 (2014)
Article DOI: 10.1016/j.bmc.2013.12.050
BindingDB Entry DOI: 10.7270/Q25H7HQM
17-beta-Hydroxysteroid Dehydrogenase 5 (17-beta-HSD5, AKR1C3)
(Homo sapiens (Human))
BDBM50446024
(CHEMBL3103356)
Show SMILES [O-][N+](=O)c1ccc(cc1)N1CCN(CC1)C(=O)N1CCOCC1
Show InChI InChI=1S/C15H20N4O4/c20-15(18-9-11-23-12-10-18)17-7-5-16(6-8-17)13-1-3-14(4-2-13)19(21)22/h1-4H,5-12H2
n/an/a 570n/an/an/an/an/an/a
University of Auckland
Curated by ChEMBL
Assay Description
Inhibition of recombinant AKR1C3 (unknown origin) after 1 hr by competitive fluorescence assay
Bioorg Med Chem 22: 967-77 (2014)
Article DOI: 10.1016/j.bmc.2013.12.050
BindingDB Entry DOI: 10.7270/Q25H7HQM