BDBM50446089 CHEMBL3108869
SMILES: Clc1ccc(CC(=O)Nc2ccc(cc2)S(=O)(=O)Nc2nncs2)cc1Cl
InChI Key: InChIKey=KZSYKOLWVMHZHD-UHFFFAOYSA-N
Data: 2 IC50
Activity Spreadsheet -- Enzyme Inhibition Constant Data from BindingDB
Found 2 hits for monomerid = 50446089
Trg + Lig
Ki
nM
ΔG°
kcal/mole
IC50
nM
Kd
nM
EC50/IC50
nM
koff
s-1
kon
M-1s-1
pHTemp
°C
6-phospho-1-fructokinase
(Trypanosoma brucei)
BDBM50446089
(CHEMBL3108869)
Show SMILES Clc1ccc(CC(=O)Nc2ccc(cc2)S(=O)(=O)Nc2nncs2)cc1Cl
Show InChI InChI=1S/C16H12Cl2N4O3S2/c17-13-6-1-10(7-14(13)18)8-15(23)20-11-2-4-12(5-3-11)27(24,25)22-16-21-19-9-26-16/h1-7,9H,8H2,(H,20,23)(H,21,22)
n/an/a 112n/an/an/an/an/an/a
National Center for Advancing Translational Sciences
Curated by ChEMBL
Assay Description
Inhibition of Trypanosoma brucei PFK-mediated ADP production using ATP/fructose-6-phosphate as substrate by luciferase based luminescence assay
ACS Med Chem Lett 5: 12-7 (2014)
BindingDB Entry DOI: 10.7270/Q2X34ZX7
6-phospho-1-fructokinase, putative
(Trypanosoma cruzi)
BDBM50446089
(CHEMBL3108869)
Show SMILES Clc1ccc(CC(=O)Nc2ccc(cc2)S(=O)(=O)Nc2nncs2)cc1Cl
Show InChI InChI=1S/C16H12Cl2N4O3S2/c17-13-6-1-10(7-14(13)18)8-15(23)20-11-2-4-12(5-3-11)27(24,25)22-16-21-19-9-26-16/h1-7,9H,8H2,(H,20,23)(H,21,22)
n/an/a 52n/an/an/an/an/an/a
National Center for Advancing Translational Sciences
Curated by ChEMBL
Assay Description
Inhibition of Trypanosoma cruzi PFK
ACS Med Chem Lett 5: 12-7 (2014)
BindingDB Entry DOI: 10.7270/Q2X34ZX7