BDBM50446106 CHEMBL3108852
SMILES: Cc1cc(NS(=O)(=O)c2ccc(NC(=O)Cc3ccc4ccccc4c3)cc2)no1
InChI Key: InChIKey=IGZIWEJRUCQXBT-UHFFFAOYSA-N
Data: 2 IC50
Activity Spreadsheet -- Enzyme Inhibition Constant Data from BindingDB
Found 2 hits for monomerid = 50446106
Trg + Lig
Ki
nM
ΔG°
kcal/mole
IC50
nM
Kd
nM
EC50/IC50
nM
koff
s-1
kon
M-1s-1
pHTemp
°C
6-phospho-1-fructokinase
(Trypanosoma brucei)
BDBM50446106
(CHEMBL3108852)
Show SMILES Cc1cc(NS(=O)(=O)c2ccc(NC(=O)Cc3ccc4ccccc4c3)cc2)no1
Show InChI InChI=1S/C22H19N3O4S/c1-15-12-21(24-29-15)25-30(27,28)20-10-8-19(9-11-20)23-22(26)14-16-6-7-17-4-2-3-5-18(17)13-16/h2-13H,14H2,1H3,(H,23,26)(H,24,25)
n/an/a 6.51E+3n/an/an/an/an/an/a
National Center for Advancing Translational Sciences
Curated by ChEMBL
Assay Description
Inhibition of Trypanosoma brucei PFK-mediated ADP production using ATP/fructose-6-phosphate as substrate by luciferase based luminescence assay
ACS Med Chem Lett 5: 12-7 (2014)
BindingDB Entry DOI: 10.7270/Q2X34ZX7
6-phospho-1-fructokinase, putative
(Trypanosoma cruzi)
BDBM50446106
(CHEMBL3108852)
Show SMILES Cc1cc(NS(=O)(=O)c2ccc(NC(=O)Cc3ccc4ccccc4c3)cc2)no1
Show InChI InChI=1S/C22H19N3O4S/c1-15-12-21(24-29-15)25-30(27,28)20-10-8-19(9-11-20)23-22(26)14-16-6-7-17-4-2-3-5-18(17)13-16/h2-13H,14H2,1H3,(H,23,26)(H,24,25)
n/an/a 1.83E+3n/an/an/an/an/an/a
National Center for Advancing Translational Sciences
Curated by ChEMBL
Assay Description
Inhibition of Trypanosoma cruzi PFK
ACS Med Chem Lett 5: 12-7 (2014)
BindingDB Entry DOI: 10.7270/Q2X34ZX7