BDBM50446121 CHEMBL3108838
SMILES: Cc1cc(NS(=O)(=O)c2ccc(NS(=O)(=O)Cc3ccc(Cl)c(Cl)c3)cc2)no1
InChI Key: InChIKey=UEBJAZZIGBSQMT-UHFFFAOYSA-N
Data: 2 IC50
Activity Spreadsheet -- Enzyme Inhibition Constant Data from BindingDB
Found 2 hits for monomerid = 50446121
Trg + Lig
Ki
nM
ΔG°
kcal/mole
IC50
nM
Kd
nM
EC50/IC50
nM
koff
s-1
kon
M-1s-1
pHTemp
°C
6-phospho-1-fructokinase
(Trypanosoma brucei)
BDBM50446121
(CHEMBL3108838)
Show SMILES Cc1cc(NS(=O)(=O)c2ccc(NS(=O)(=O)Cc3ccc(Cl)c(Cl)c3)cc2)no1
Show InChI InChI=1S/C17H15Cl2N3O5S2/c1-11-8-17(20-27-11)22-29(25,26)14-5-3-13(4-6-14)21-28(23,24)10-12-2-7-15(18)16(19)9-12/h2-9,21H,10H2,1H3,(H,20,22)
n/an/a 3.70E+4n/an/an/an/an/an/a
National Center for Advancing Translational Sciences
Curated by ChEMBL
Assay Description
Inhibition of Trypanosoma brucei PFK-mediated ADP production using ATP/fructose-6-phosphate as substrate by luciferase based luminescence assay
ACS Med Chem Lett 5: 12-7 (2014)
BindingDB Entry DOI: 10.7270/Q2X34ZX7
6-phospho-1-fructokinase, putative
(Trypanosoma cruzi)
BDBM50446121
(CHEMBL3108838)
Show SMILES Cc1cc(NS(=O)(=O)c2ccc(NS(=O)(=O)Cc3ccc(Cl)c(Cl)c3)cc2)no1
Show InChI InChI=1S/C17H15Cl2N3O5S2/c1-11-8-17(20-27-11)22-29(25,26)14-5-3-13(4-6-14)21-28(23,24)10-12-2-7-15(18)16(19)9-12/h2-9,21H,10H2,1H3,(H,20,22)
n/an/a>5.70E+4n/an/an/an/an/an/a
National Center for Advancing Translational Sciences
Curated by ChEMBL
Assay Description
Inhibition of Trypanosoma cruzi PFK
ACS Med Chem Lett 5: 12-7 (2014)
BindingDB Entry DOI: 10.7270/Q2X34ZX7