null
SMILES: CC(C)(C)n1nc(c(C(N)=O)c1N)-c1ccc2ccccc2n1
InChI Key: InChIKey=YKVANMRHVMVLJX-UHFFFAOYSA-N
PDB links: 1 PDB ID matches this monomer.
Activity Spreadsheet -- Enzyme Inhibition Constant Data from BindingDB
Found 5 hits for monomerid = 50446155
Trg + Lig
Ki
nM
ΔG°
kcal/mole
IC50
nM
Kd
nM
EC50/IC50
nM
koff
s-1
kon
M-1s-1
pHTemp
°C
Calmodulin-domain protein kinase 1
(Toxoplasma gondii)
BDBM50446155
(CHEMBL3109007 | US9518026, Example 35 | US9956214,...)
Show SMILES CC(C)(C)n1nc(c(C(N)=O)c1N)-c1ccc2ccccc2n1
Show InChI InChI=1S/C17H19N5O/c1-17(2,3)22-15(18)13(16(19)23)14(21-22)12-9-8-10-6-4-5-7-11(10)20-12/h4-9H,18H2,1-3H3,(H2,19,23)
n/an/a 49n/an/an/an/an/an/a
University of Washington
Curated by ChEMBL
Assay Description
Inhibition of Toxoplasma gondii CDPK1 using PLARTLSVAGLPGKK-OH as substrate
ACS Med Chem Lett 5: 40-44 (2014)
Article DOI: 10.1021/ml400315s
BindingDB Entry DOI: 10.7270/Q28917BZ
3D
3D Structure (crystal)
Calmodulin-domain protein kinase 1
(Toxoplasma gondii)
BDBM50446155
(CHEMBL3109007 | US9518026, Example 35 | US9956214,...)
Show SMILES CC(C)(C)n1nc(c(C(N)=O)c1N)-c1ccc2ccccc2n1
Show InChI InChI=1S/C17H19N5O/c1-17(2,3)22-15(18)13(16(19)23)14(21-22)12-9-8-10-6-4-5-7-11(10)20-12/h4-9H,18H2,1-3H3,(H2,19,23)
US Patent
n/an/a 49n/an/an/an/an/an/a
University of Washington Through its Center For Commercialization
US Patent
Assay Description
Inhibition of TgCDPK1 and CpCDPK1 was determined using a luminescent kinase assay which measures ATP depletion in the presence of the Syntide 2 pepti...
US Patent US9518026 (2016)
BindingDB Entry DOI: 10.7270/Q2BV7JN4
3D
3D Structure (crystal)
Calcium-dependent protein kinase 1
(Cryptosporidium parvum)
BDBM50446155
(CHEMBL3109007 | US9518026, Example 35 | US9956214,...)
Show SMILES CC(C)(C)n1nc(c(C(N)=O)c1N)-c1ccc2ccccc2n1
Show InChI InChI=1S/C17H19N5O/c1-17(2,3)22-15(18)13(16(19)23)14(21-22)12-9-8-10-6-4-5-7-11(10)20-12/h4-9H,18H2,1-3H3,(H2,19,23)
US Patent
n/an/a 290n/an/an/an/an/an/a
Boehringer Ingelheim (Canada) Ltd.
Assay Description
Inhibition of TgCDPK1 and CpCDPK1 was determined using a luminescent kinase assay which measures ATP depletion in the presence of the Syntide 2 pepti...
Bioorg Med Chem Lett 19: 1199-205 (2009)
BindingDB Entry DOI: 10.7270/Q23J3G91
Calmodulin-domain protein kinase 1
(Toxoplasma gondii)
BDBM50446155
(CHEMBL3109007 | US9518026, Example 35 | US9956214,...)
Show SMILES CC(C)(C)n1nc(c(C(N)=O)c1N)-c1ccc2ccccc2n1
Show InChI InChI=1S/C17H19N5O/c1-17(2,3)22-15(18)13(16(19)23)14(21-22)12-9-8-10-6-4-5-7-11(10)20-12/h4-9H,18H2,1-3H3,(H2,19,23)
US Patent
n/an/a 49n/an/an/an/an/an/a
Boehringer Ingelheim (Canada) Ltd.
Assay Description
Inhibition of TgCDPK1 and CpCDPK1 was determined using a luminescent kinase assay which measures ATP depletion in the presence of the Syntide 2 pepti...
Bioorg Med Chem Lett 19: 1199-205 (2009)
BindingDB Entry DOI: 10.7270/Q23J3G91
3D
3D Structure (crystal)
Uncharacterized protein
(Cryptosporidium parvum)
BDBM50446155
(CHEMBL3109007 | US9518026, Example 35 | US9956214,...)
Show SMILES CC(C)(C)n1nc(c(C(N)=O)c1N)-c1ccc2ccccc2n1
Show InChI InChI=1S/C17H19N5O/c1-17(2,3)22-15(18)13(16(19)23)14(21-22)12-9-8-10-6-4-5-7-11(10)20-12/h4-9H,18H2,1-3H3,(H2,19,23)
US Patent
n/an/a 290n/an/an/an/an/an/a
University of Washington Through its Center For Commercialization
US Patent
Assay Description
Inhibition of TgCDPK1 and CpCDPK1 was determined using a luminescent kinase assay which measures ATP depletion in the presence of the Syntide 2 pepti...
US Patent US9518026 (2016)
BindingDB Entry DOI: 10.7270/Q2BV7JN4