BDBM50446157 CHEMBL3108994::US9518026, Example 21::US9956214, Compound 21
SMILES: CN1CCC(Cn2nc(c(C(N)=O)c2N)-c2ccc3ccccc3c2)CC1
InChI Key: InChIKey=VZGULHBHJBIHDH-UHFFFAOYSA-N
Data: 5 IC50
Activity Spreadsheet -- Enzyme Inhibition Constant Data from BindingDB
Found 5 hits for monomerid = 50446157
Trg + Lig
Ki
nM
ΔG°
kcal/mole
IC50
nM
Kd
nM
EC50/IC50
nM
koff
s-1
kon
M-1s-1
pHTemp
°C
Calmodulin-domain protein kinase 1 (CDPK1)
(Toxoplasma gondii)
BDBM50446157
(CHEMBL3108994 | US9518026, Example 21 | US9956214,...)
Show SMILES CN1CCC(Cn2nc(c(C(N)=O)c2N)-c2ccc3ccccc3c2)CC1
Show InChI InChI=1S/C21H25N5O/c1-25-10-8-14(9-11-25)13-26-20(22)18(21(23)27)19(24-26)17-7-6-15-4-2-3-5-16(15)12-17/h2-7,12,14H,8-11,13,22H2,1H3,(H2,23,27)
n/an/a 39n/an/an/an/an/an/a
University of Washington
Curated by ChEMBL
Assay Description
Inhibition of Toxoplasma gondii CDPK1 using PLARTLSVAGLPGKK-OH as substrate
ACS Med Chem Lett 5: 40-44 (2014)
Article DOI: 10.1021/ml400315s
BindingDB Entry DOI: 10.7270/Q28917BZ
Calmodulin-domain protein kinase 1 (CDPK1)
(Toxoplasma gondii)
BDBM50446157
(CHEMBL3108994 | US9518026, Example 21 | US9956214,...)
Show SMILES CN1CCC(Cn2nc(c(C(N)=O)c2N)-c2ccc3ccccc3c2)CC1
Show InChI InChI=1S/C21H25N5O/c1-25-10-8-14(9-11-25)13-26-20(22)18(21(23)27)19(24-26)17-7-6-15-4-2-3-5-16(15)12-17/h2-7,12,14H,8-11,13,22H2,1H3,(H2,23,27)
US Patent
n/an/a 39n/an/an/an/an/an/a
University of Washington Through its Center For Commercialization
US Patent
Assay Description
Inhibition of TgCDPK1 and CpCDPK1 was determined using a luminescent kinase assay which measures ATP depletion in the presence of the Syntide 2 pepti...
US Patent US9518026 (2016)
BindingDB Entry DOI: 10.7270/Q2BV7JN4
Calcium-dependent protein kinase 1 (CDPK1)
(Cryptosporidium parvum)
BDBM50446157
(CHEMBL3108994 | US9518026, Example 21 | US9956214,...)
Show SMILES CN1CCC(Cn2nc(c(C(N)=O)c2N)-c2ccc3ccccc3c2)CC1
Show InChI InChI=1S/C21H25N5O/c1-25-10-8-14(9-11-25)13-26-20(22)18(21(23)27)19(24-26)17-7-6-15-4-2-3-5-16(15)12-17/h2-7,12,14H,8-11,13,22H2,1H3,(H2,23,27)
US Patent
n/an/a 17n/an/an/an/an/an/a
Boehringer Ingelheim (Canada) Ltd.
Assay Description
Inhibition of TgCDPK1 and CpCDPK1 was determined using a luminescent kinase assay which measures ATP depletion in the presence of the Syntide 2 pepti...
Bioorg Med Chem Lett 19: 1199-205 (2009)
BindingDB Entry DOI: 10.7270/Q23J3G91
Calmodulin-domain protein kinase 1 (CDPK1)
(Toxoplasma gondii)
BDBM50446157
(CHEMBL3108994 | US9518026, Example 21 | US9956214,...)
Show SMILES CN1CCC(Cn2nc(c(C(N)=O)c2N)-c2ccc3ccccc3c2)CC1
Show InChI InChI=1S/C21H25N5O/c1-25-10-8-14(9-11-25)13-26-20(22)18(21(23)27)19(24-26)17-7-6-15-4-2-3-5-16(15)12-17/h2-7,12,14H,8-11,13,22H2,1H3,(H2,23,27)
US Patent
n/an/a 39n/an/an/an/an/an/a
Boehringer Ingelheim (Canada) Ltd.
Assay Description
Inhibition of TgCDPK1 and CpCDPK1 was determined using a luminescent kinase assay which measures ATP depletion in the presence of the Syntide 2 pepti...
Bioorg Med Chem Lett 19: 1199-205 (2009)
BindingDB Entry DOI: 10.7270/Q23J3G91
Calmodulin-domain protein kinase (CDPK1)
(Cryptosporidium parvum)
BDBM50446157
(CHEMBL3108994 | US9518026, Example 21 | US9956214,...)
Show SMILES CN1CCC(Cn2nc(c(C(N)=O)c2N)-c2ccc3ccccc3c2)CC1
Show InChI InChI=1S/C21H25N5O/c1-25-10-8-14(9-11-25)13-26-20(22)18(21(23)27)19(24-26)17-7-6-15-4-2-3-5-16(15)12-17/h2-7,12,14H,8-11,13,22H2,1H3,(H2,23,27)
US Patent
n/an/a 17n/an/an/an/an/an/a
University of Washington Through its Center For Commercialization
US Patent
Assay Description
Inhibition of TgCDPK1 and CpCDPK1 was determined using a luminescent kinase assay which measures ATP depletion in the presence of the Syntide 2 pepti...
US Patent US9518026 (2016)
BindingDB Entry DOI: 10.7270/Q2BV7JN4