BDBM50446165 CHEMBL3108992::US9518026, Example 19::US9956214, Compound 19
SMILES: CC(C)(C)Cn1nc(c(C(N)=O)c1N)-c1ccc2ccccc2c1
InChI Key: InChIKey=MBGIYYACOFRHPK-UHFFFAOYSA-N
Data: 5 IC50
Activity Spreadsheet -- Enzyme Inhibition Constant Data from BindingDB
Found 5 hits for monomerid = 50446165
Trg + Lig
Ki
nM
ΔG°
kcal/mole
IC50
nM
Kd
nM
EC50/IC50
nM
koff
s-1
kon
M-1s-1
pHTemp
°C
Calmodulin-domain protein kinase 1 (CDPK1)
(Toxoplasma gondii)
BDBM50446165
(CHEMBL3108992 | US9518026, Example 19 | US9956214,...)
Show SMILES CC(C)(C)Cn1nc(c(C(N)=O)c1N)-c1ccc2ccccc2c1
Show InChI InChI=1S/C19H22N4O/c1-19(2,3)11-23-17(20)15(18(21)24)16(22-23)14-9-8-12-6-4-5-7-13(12)10-14/h4-10H,11,20H2,1-3H3,(H2,21,24)
n/an/a 11n/an/an/an/an/an/a
University of Washington
Curated by ChEMBL
Assay Description
Inhibition of Toxoplasma gondii CDPK1 using PLARTLSVAGLPGKK-OH as substrate
ACS Med Chem Lett 5: 40-44 (2014)
Article DOI: 10.1021/ml400315s
BindingDB Entry DOI: 10.7270/Q28917BZ
Calmodulin-domain protein kinase 1 (CDPK1)
(Toxoplasma gondii)
BDBM50446165
(CHEMBL3108992 | US9518026, Example 19 | US9956214,...)
Show SMILES CC(C)(C)Cn1nc(c(C(N)=O)c1N)-c1ccc2ccccc2c1
Show InChI InChI=1S/C19H22N4O/c1-19(2,3)11-23-17(20)15(18(21)24)16(22-23)14-9-8-12-6-4-5-7-13(12)10-14/h4-10H,11,20H2,1-3H3,(H2,21,24)
US Patent
n/an/a 11n/an/an/an/an/an/a
University of Washington Through its Center For Commercialization
US Patent
Assay Description
Inhibition of TgCDPK1 and CpCDPK1 was determined using a luminescent kinase assay which measures ATP depletion in the presence of the Syntide 2 pepti...
US Patent US9518026 (2016)
BindingDB Entry DOI: 10.7270/Q2BV7JN4
Calcium-dependent protein kinase 1 (CDPK1)
(Cryptosporidium parvum)
BDBM50446165
(CHEMBL3108992 | US9518026, Example 19 | US9956214,...)
Show SMILES CC(C)(C)Cn1nc(c(C(N)=O)c1N)-c1ccc2ccccc2c1
Show InChI InChI=1S/C19H22N4O/c1-19(2,3)11-23-17(20)15(18(21)24)16(22-23)14-9-8-12-6-4-5-7-13(12)10-14/h4-10H,11,20H2,1-3H3,(H2,21,24)
US Patent
n/an/a 24n/an/an/an/an/an/a
Boehringer Ingelheim (Canada) Ltd.
Assay Description
Inhibition of TgCDPK1 and CpCDPK1 was determined using a luminescent kinase assay which measures ATP depletion in the presence of the Syntide 2 pepti...
Bioorg Med Chem Lett 19: 1199-205 (2009)
BindingDB Entry DOI: 10.7270/Q23J3G91
Calmodulin-domain protein kinase 1 (CDPK1)
(Toxoplasma gondii)
BDBM50446165
(CHEMBL3108992 | US9518026, Example 19 | US9956214,...)
Show SMILES CC(C)(C)Cn1nc(c(C(N)=O)c1N)-c1ccc2ccccc2c1
Show InChI InChI=1S/C19H22N4O/c1-19(2,3)11-23-17(20)15(18(21)24)16(22-23)14-9-8-12-6-4-5-7-13(12)10-14/h4-10H,11,20H2,1-3H3,(H2,21,24)
US Patent
n/an/a 11n/an/an/an/an/an/a
Boehringer Ingelheim (Canada) Ltd.
Assay Description
Inhibition of TgCDPK1 and CpCDPK1 was determined using a luminescent kinase assay which measures ATP depletion in the presence of the Syntide 2 pepti...
Bioorg Med Chem Lett 19: 1199-205 (2009)
BindingDB Entry DOI: 10.7270/Q23J3G91
Calmodulin-domain protein kinase (CDPK1)
(Cryptosporidium parvum)
BDBM50446165
(CHEMBL3108992 | US9518026, Example 19 | US9956214,...)
Show SMILES CC(C)(C)Cn1nc(c(C(N)=O)c1N)-c1ccc2ccccc2c1
Show InChI InChI=1S/C19H22N4O/c1-19(2,3)11-23-17(20)15(18(21)24)16(22-23)14-9-8-12-6-4-5-7-13(12)10-14/h4-10H,11,20H2,1-3H3,(H2,21,24)
US Patent
n/an/a 24n/an/an/an/an/an/a
University of Washington Through its Center For Commercialization
US Patent
Assay Description
Inhibition of TgCDPK1 and CpCDPK1 was determined using a luminescent kinase assay which measures ATP depletion in the presence of the Syntide 2 pepti...
US Patent US9518026 (2016)
BindingDB Entry DOI: 10.7270/Q2BV7JN4