BDBM50446269 CHEMBL3109209
SMILES: Fc1ccc(cc1NC(=O)Nc1cccc(c1)-c1c[nH]c2ncc(cc12)-c1cccnc1)C(F)(F)F
InChI Key: InChIKey=HQPGNAQSHLIGDV-UHFFFAOYSA-N
Data: 3 IC50
Activity Spreadsheet -- Enzyme Inhibition Constant Data from BindingDB
Found 3 hits for monomerid = 50446269
Trg + Lig
Ki
nM
ΔG°
kcal/mole
IC50
nM
Kd
nM
EC50/IC50
nM
koff
s-1
kon
M-1s-1
pHTemp
°C
Receptor-interacting serine/threonine-protein kinase 1
(Homo sapiens (Human))
BDBM50446269
(CHEMBL3109209)
Show SMILES Fc1ccc(cc1NC(=O)Nc1cccc(c1)-c1c[nH]c2ncc(cc12)-c1cccnc1)C(F)(F)F
Show InChI InChI=1S/C26H17F4N5O/c27-22-7-6-18(26(28,29)30)11-23(22)35-25(36)34-19-5-1-3-15(9-19)21-14-33-24-20(21)10-17(13-32-24)16-4-2-8-31-12-16/h1-14H,(H,32,33)(H2,34,35,36)
n/an/a 7.90n/an/an/an/an/an/a
GlaxoSmithKline
Curated by ChEMBL
Assay Description
Displacement of (14-(2-{[3-({2-{[4-(cyanomethyl)phenyl]amino}-6-[(5-cyclopropyl-1H-pyrazol-3-yl)amino]-4-pyrimidinyl}amino)propyl]amino}-2-oxoethyl)-...
ACS Med Chem Lett 4: 1238-43 (2013)
Article DOI: 10.1021/ml400382p
BindingDB Entry DOI: 10.7270/Q2C24XW2
Receptor-interacting serine/threonine-protein kinase 1
(Homo sapiens (Human))
BDBM50446269
(CHEMBL3109209)
Show SMILES Fc1ccc(cc1NC(=O)Nc1cccc(c1)-c1c[nH]c2ncc(cc12)-c1cccnc1)C(F)(F)F
Show InChI InChI=1S/C26H17F4N5O/c27-22-7-6-18(26(28,29)30)11-23(22)35-25(36)34-19-5-1-3-15(9-19)21-14-33-24-20(21)10-17(13-32-24)16-4-2-8-31-12-16/h1-14H,(H,32,33)(H2,34,35,36)
n/an/a 4n/an/an/an/an/an/a
GlaxoSmithKline
Curated by ChEMBL
Assay Description
Inhibition of human N-terminal His-GST-TEV-fused RIP1 kinase domain (1 to 375) autophosphorylation expressed in baculovirus infected insect Sf9 cells...
ACS Med Chem Lett 4: 1238-43 (2013)
Article DOI: 10.1021/ml400382p
BindingDB Entry DOI: 10.7270/Q2C24XW2
Receptor-interacting serine/threonine-protein kinase 1
(Homo sapiens (Human))
BDBM50446269
(CHEMBL3109209)
Show SMILES Fc1ccc(cc1NC(=O)Nc1cccc(c1)-c1c[nH]c2ncc(cc12)-c1cccnc1)C(F)(F)F
Show InChI InChI=1S/C26H17F4N5O/c27-22-7-6-18(26(28,29)30)11-23(22)35-25(36)34-19-5-1-3-15(9-19)21-14-33-24-20(21)10-17(13-32-24)16-4-2-8-31-12-16/h1-14H,(H,32,33)(H2,34,35,36)
n/an/a 6.30n/an/an/an/an/an/a
GlaxoSmithKline
Curated by ChEMBL
Assay Description
Inhibition of RIP1 in human U937 cells assessed as prevention of TNFalpha/zVAD.fmk-induced necrotic cell death preincubated for 30 to 60 mins followe...
ACS Med Chem Lett 4: 1238-43 (2013)
Article DOI: 10.1021/ml400382p
BindingDB Entry DOI: 10.7270/Q2C24XW2