BDBM50446318 CHEMBL3109344
SMILES: COCCOc1ccn2c(cnc2c1)-c1ccc2cccc(O[C@H]3CCCNC3)c2n1
InChI Key: InChIKey=TXAFYFWHBVJGHQ-IBGZPJMESA-N
Data: 2 IC50
Activity Spreadsheet -- Enzyme Inhibition Constant Data from BindingDB
Found 2 hits for monomerid = 50446318
Trg + Lig
Ki
nM
ΔG°
kcal/mole
IC50
nM
Kd
nM
EC50/IC50
nM
koff
s-1
kon
M-1s-1
pHTemp
°C
Platelet-derived growth factor receptor beta
(Mus musculus (mouse))
BDBM50446318
(CHEMBL3109344)
Show SMILES COCCOc1ccn2c(cnc2c1)-c1ccc2cccc(O[C@H]3CCCNC3)c2n1 |r|
Show InChI InChI=1S/C24H26N4O3/c1-29-12-13-30-18-9-11-28-21(16-26-23(28)14-18)20-8-7-17-4-2-6-22(24(17)27-20)31-19-5-3-10-25-15-19/h2,4,6-9,11,14,16,19,25H,3,5,10,12-13,15H2,1H3/t19-/m0/s1
n/an/a 5n/an/an/an/an/an/a
Array BioPharma
Curated by ChEMBL
Assay Description
Inhibition of PDGF-induced PDGFRbeta phosphorylation in mouse NIH3T3 cells incubated for 1 hr prior to PDGF induction measured after 15 mins by fluor...
ACS Med Chem Lett 5: 78-83 (2014)
Article DOI: 10.1021/ml4003953
BindingDB Entry DOI: 10.7270/Q23N24VQ
Macrophage colony stimulating factor receptor
(Homo sapiens (Human))
BDBM50446318
(CHEMBL3109344)
Show SMILES COCCOc1ccn2c(cnc2c1)-c1ccc2cccc(O[C@H]3CCCNC3)c2n1 |r|
Show InChI InChI=1S/C24H26N4O3/c1-29-12-13-30-18-9-11-28-21(16-26-23(28)14-18)20-8-7-17-4-2-6-22(24(17)27-20)31-19-5-3-10-25-15-19/h2,4,6-9,11,14,16,19,25H,3,5,10,12-13,15H2,1H3/t19-/m0/s1
n/an/a 21n/an/an/an/an/an/a
Array BioPharma
Curated by ChEMBL
Assay Description
Inhibition of cFMS (unknown origin)
ACS Med Chem Lett 5: 78-83 (2014)
Article DOI: 10.1021/ml4003953
BindingDB Entry DOI: 10.7270/Q23N24VQ