BDBM50446322 CHEMBL3109339
SMILES: COCCOc1ccn2c(cnc2c1)-c1ccc2cccc(OCC(C)(C)CN)c2n1
InChI Key: InChIKey=OEQLYHXNGSLNQN-UHFFFAOYSA-N
Data: 3 IC50
Activity Spreadsheet -- Enzyme Inhibition Constant Data from BindingDB
Found 3 hits for monomerid = 50446322
Trg + Lig
Ki
nM
ΔG°
kcal/mole
IC50
nM
Kd
nM
EC50/IC50
nM
koff
s-1
kon
M-1s-1
pHTemp
°C
Platelet-derived growth factor receptor beta
(Mus musculus (mouse))
BDBM50446322
(CHEMBL3109339)
Show SMILES COCCOc1ccn2c(cnc2c1)-c1ccc2cccc(OCC(C)(C)CN)c2n1
Show InChI InChI=1S/C24H28N4O3/c1-24(2,15-25)16-31-21-6-4-5-17-7-8-19(27-23(17)21)20-14-26-22-13-18(9-10-28(20)22)30-12-11-29-3/h4-10,13-14H,11-12,15-16,25H2,1-3H3
n/an/a 18n/an/an/an/an/an/a
Array BioPharma
Curated by ChEMBL
Assay Description
Inhibition of PDGF-induced PDGFRbeta phosphorylation in mouse NIH3T3 cells incubated for 1 hr prior to PDGF induction measured after 15 mins by fluor...
ACS Med Chem Lett 5: 78-83 (2014)
Article DOI: 10.1021/ml4003953
BindingDB Entry DOI: 10.7270/Q23N24VQ
Receptor-type tyrosine-protein kinase FLT3
(Homo sapiens (Human))
BDBM50446322
(CHEMBL3109339)
Show SMILES COCCOc1ccn2c(cnc2c1)-c1ccc2cccc(OCC(C)(C)CN)c2n1
Show InChI InChI=1S/C24H28N4O3/c1-24(2,15-25)16-31-21-6-4-5-17-7-8-19(27-23(17)21)20-14-26-22-13-18(9-10-28(20)22)30-12-11-29-3/h4-10,13-14H,11-12,15-16,25H2,1-3H3
n/an/a 47n/an/an/an/an/an/a
Array BioPharma
Curated by ChEMBL
Assay Description
Inhibition of FLT3 (unknown origin)
ACS Med Chem Lett 5: 78-83 (2014)
Article DOI: 10.1021/ml4003953
BindingDB Entry DOI: 10.7270/Q23N24VQ
Macrophage colony stimulating factor receptor
(Homo sapiens (Human))
BDBM50446322
(CHEMBL3109339)
Show SMILES COCCOc1ccn2c(cnc2c1)-c1ccc2cccc(OCC(C)(C)CN)c2n1
Show InChI InChI=1S/C24H28N4O3/c1-24(2,15-25)16-31-21-6-4-5-17-7-8-19(27-23(17)21)20-14-26-22-13-18(9-10-28(20)22)30-12-11-29-3/h4-10,13-14H,11-12,15-16,25H2,1-3H3
n/an/a 73n/an/an/an/an/an/a
Array BioPharma
Curated by ChEMBL
Assay Description
Inhibition of cFMS (unknown origin)
ACS Med Chem Lett 5: 78-83 (2014)
Article DOI: 10.1021/ml4003953
BindingDB Entry DOI: 10.7270/Q23N24VQ