BDBM50446386 CHEMBL3109631
SMILES: COc1cc2c(cc1OCC1CCN(C)C1)N=C(N)C21CCC1
InChI Key: InChIKey=JNRMDRJLSGDMSO-UHFFFAOYSA-N
Data: 1 IC50
Activity Spreadsheet -- Enzyme Inhibition Constant Data from BindingDB
Found 1 hit for monomerid = 50446386
Trg + Lig
Ki
nM
ΔG°
kcal/mole
IC50
nM
Kd
nM
EC50/IC50
nM
koff
s-1
kon
M-1s-1
pHTemp
°C
Protein G9a (G9a)
(Homo sapiens (Human))
BDBM50446386
(CHEMBL3109631)
Show SMILES COc1cc2c(cc1OCC1CCN(C)C1)N=C(N)C21CCC1 |t:18|
Show InChI InChI=1S/C18H25N3O2/c1-21-7-4-12(10-21)11-23-16-9-14-13(8-15(16)22-2)18(5-3-6-18)17(19)20-14/h8-9,12H,3-7,10-11H2,1-2H3,(H2,19,20)
n/an/a 1n/an/an/an/an/an/a
AbbVie Inc.
Curated by ChEMBL
Assay Description
Inhibition of G9a (unknown origin) using biotinylated-histone H3(1-21) peptide as substrate after 3 hrs by AlphaLISA assay
ACS Med Chem Lett 5: 205-9 (2014)
Article DOI: 10.1021/ml400496h
BindingDB Entry DOI: 10.7270/Q2FT8NJ0