BDBM50446396 CHEMBL3109654
SMILES: NC(=O)c1nn(CC(=O)N2[C@@H]3C[C@@H]3C[C@H]2C(=O)Nc2cccc(I)n2)c2ccccc12
InChI Key: InChIKey=MMWQUYSPYISYHV-DFBGVHRSSA-N
Data: 1 IC50
Activity Spreadsheet -- Enzyme Inhibition Constant Data from BindingDB
Found 1 hit for monomerid = 50446396
Trg + Lig
Ki
nM
ΔG°
kcal/mole
IC50
nM
Kd
nM
EC50/IC50
nM
koff
s-1
kon
M-1s-1
pHTemp
°C
Complement factor D
(Homo sapiens (Human))
BDBM50446396
(CHEMBL3109654)
Show SMILES NC(=O)c1nn(CC(=O)N2[C@@H]3C[C@@H]3C[C@H]2C(=O)Nc2cccc(I)n2)c2ccccc12 |r|
Show InChI InChI=1S/C21H19IN6O3/c22-16-6-3-7-17(24-16)25-21(31)15-9-11-8-14(11)28(15)18(29)10-27-13-5-2-1-4-12(13)19(26-27)20(23)30/h1-7,11,14-15H,8-10H2,(H2,23,30)(H,24,25,31)/t11-,14-,15+/m1/s1
n/an/a 3n/an/an/an/an/an/a
Therachem Research Medilab (India) Pvt. Ltd.
Curated by ChEMBL
Assay Description
Inhibition of recombinant human factor D expressed in Escherichia coli using Z-Lys-thiobenzyl and 2,4-dinitrobenzenesulfonyl-fluoresceine as substrat...
ACS Med Chem Lett 5: 106-7 (2014)
Article DOI: 10.1021/ml500037a
BindingDB Entry DOI: 10.7270/Q26D5VG4