BDBM50446409 CHEMBL3109724
SMILES: Oc1ccc(c(O)c1)-c1cccc2Sc3ccccc3Sc12
InChI Key: InChIKey=SFHCRTNQKWZASO-UHFFFAOYSA-N
Data: 4 IC50
Activity Spreadsheet -- Enzyme Inhibition Constant Data from BindingDB
Found 4 hits for monomerid = 50446409
Trg + Lig
Ki
nM
ΔG°
kcal/mole
IC50
nM
Kd
nM
EC50/IC50
nM
koff
s-1
kon
M-1s-1
pHTemp
°C
Arachidonate 15-lipoxygenase
(Homo sapiens (Human))
BDBM50446409
(CHEMBL3109724)
Show SMILES Oc1ccc(c(O)c1)-c1cccc2Sc3ccccc3Sc12
Show InChI InChI=1S/C18H12O2S2/c19-11-8-9-12(14(20)10-11)13-4-3-7-17-18(13)22-16-6-2-1-5-15(16)21-17/h1-10,19-20H
Reactome pathway
n/an/a>1.00E+4n/an/an/an/an/an/a
University of Salerno
Curated by ChEMBL
Assay Description
Inhibition of 15-LO in human PMNL using arachidonic acid as substrate preincubated for 15 mins
Eur J Med Chem 67: 269-79 (2013)
Article DOI: 10.1016/j.ejmech.2013.06.039
BindingDB Entry DOI: 10.7270/Q2XW4M9Z
12-Lipoxygenase (12-LOX)
(Homo sapiens (Human))
BDBM50446409
(CHEMBL3109724)
Show SMILES Oc1ccc(c(O)c1)-c1cccc2Sc3ccccc3Sc12
Show InChI InChI=1S/C18H12O2S2/c19-11-8-9-12(14(20)10-11)13-4-3-7-17-18(13)22-16-6-2-1-5-15(16)21-17/h1-10,19-20H
n/an/a>1.00E+4n/an/an/an/an/an/a
University of Salerno
Curated by ChEMBL
Assay Description
Inhibition of 12-LO in human PMNL using arachidonic acid preincubated for 15 mins
Eur J Med Chem 67: 269-79 (2013)
Article DOI: 10.1016/j.ejmech.2013.06.039
BindingDB Entry DOI: 10.7270/Q2XW4M9Z
Arachidonate 5-lipoxygenase
(Homo sapiens (Human))
BDBM50446409
(CHEMBL3109724)
Show SMILES Oc1ccc(c(O)c1)-c1cccc2Sc3ccccc3Sc12
Show InChI InChI=1S/C18H12O2S2/c19-11-8-9-12(14(20)10-11)13-4-3-7-17-18(13)22-16-6-2-1-5-15(16)21-17/h1-10,19-20H
Reactome pathway
n/an/a 2.10E+3n/an/an/an/an/an/a
University of Salerno
Curated by ChEMBL
Assay Description
Inhibition of 5-LO in human PMNL using arachidonic acid as substrate preincubated for 15 mins
Eur J Med Chem 67: 269-79 (2013)
Article DOI: 10.1016/j.ejmech.2013.06.039
BindingDB Entry DOI: 10.7270/Q2XW4M9Z
Arachidonate 5-lipoxygenase
(Homo sapiens (Human))
BDBM50446409
(CHEMBL3109724)
Show SMILES Oc1ccc(c(O)c1)-c1cccc2Sc3ccccc3Sc12
Show InChI InChI=1S/C18H12O2S2/c19-11-8-9-12(14(20)10-11)13-4-3-7-17-18(13)22-16-6-2-1-5-15(16)21-17/h1-10,19-20H
Reactome pathway
n/an/a 3.20E+3n/an/an/an/an/an/a
University of Salerno
Curated by ChEMBL
Assay Description
Inhibition of human recombinant 5-LO expressed in Escherichia coli BL21 using arachidonic acid as substrate after 10 mins
Eur J Med Chem 67: 269-79 (2013)
Article DOI: 10.1016/j.ejmech.2013.06.039
BindingDB Entry DOI: 10.7270/Q2XW4M9Z