BDBM50446561 CHEMBL3110215
SMILES: Nc1ncnc2n([C@@H]3O[C@H](COP(O)(=O)OP(O)(=O)OC[C@H]4OC(O)[C@H](O)[C@@H]4O)[C@@H](O)[C@H]3O)c(nc12)-c1ccccc1
InChI Key: InChIKey=JPDYPPFZVJRWLC-BTOTZMDQSA-N
Data: 1 IC50
Activity Spreadsheet -- Enzyme Inhibition Constant Data from BindingDB
Found 1 hit for monomerid = 50446561
Trg + Lig
Ki
nM
ΔG°
kcal/mole
IC50
nM
Kd
nM
EC50/IC50
nM
koff
s-1
kon
M-1s-1
pHTemp
°C
Transient receptor potential cation channel subfamily M member 2
(Homo sapiens (Human))
BDBM50446561
(CHEMBL3110215)
Show SMILES Nc1ncnc2n([C@@H]3O[C@H](COP(O)(=O)OP(O)(=O)OC[C@H]4OC(O)[C@H](O)[C@@H]4O)[C@@H](O)[C@H]3O)c(nc12)-c1ccccc1 |r|
Show InChI InChI=1S/C21H27N5O14P2/c22-17-12-19(24-8-23-17)26(18(25-12)9-4-2-1-3-5-9)20-15(29)13(27)10(38-20)6-36-41(32,33)40-42(34,35)37-7-11-14(28)16(30)21(31)39-11/h1-5,8,10-11,13-16,20-21,27-31H,6-7H2,(H,32,33)(H,34,35)(H2,22,23,24)/t10-,11-,13-,14-,15-,16-,20-,21?/m1/s1
Reactome pathway
n/an/a 1.10E+4n/an/an/an/an/an/a
University of Bath
Curated by ChEMBL
Assay Description
Antagonist activity at human TRPM2 expressed in HEK293 cells assessed as inhibition of ADPR-induced maximum outward potassium current at +15 mV by wh...
J Med Chem 56: 10079-102 (2013)
Article DOI: 10.1021/jm401497a
BindingDB Entry DOI: 10.7270/Q2CZ38P3