BDBM50446755 CHEMBL3114608
SMILES: O=C(N[C@H]1C[C@@H]1c1ccccc1)N1CCC(CC1)Oc1ccc(cc1)-c1nnn[nH]1
InChI Key: InChIKey=YPXHRVREWGTCMZ-UXHICEINSA-N
Data: 3 IC50
Activity Spreadsheet -- Enzyme Inhibition Constant Data from BindingDB
Found 3 hits for monomerid = 50446755
Trg + Lig
Ki
nM
ΔG°
kcal/mole
IC50
nM
Kd
nM
EC50/IC50
nM
koff
s-1
kon
M-1s-1
pHTemp
°C
Cytochrome P450 2C8
(Homo sapiens (Human))
BDBM50446755
(CHEMBL3114608)
Show SMILES O=C(N[C@H]1C[C@@H]1c1ccccc1)N1CCC(CC1)Oc1ccc(cc1)-c1nnn[nH]1 |r|
Show InChI InChI=1S/C22H24N6O2/c29-22(23-20-14-19(20)15-4-2-1-3-5-15)28-12-10-18(11-13-28)30-17-8-6-16(7-9-17)21-24-26-27-25-21/h1-9,18-20H,10-14H2,(H,23,29)(H,24,25,26,27)/t19-,20+/m1/s1
n/an/a 800n/an/an/an/an/an/a
Dainippon Sumitomo Pharma Co., Ltd
Curated by ChEMBL
Assay Description
Inhibition of CYP2C8 in human liver microsomes after 10 mins by LC/MS/MS analysis
Bioorg Med Chem 22: 1548-57 (2014)
Article DOI: 10.1016/j.bmc.2014.01.040
BindingDB Entry DOI: 10.7270/Q22F7PW9
EBifunctional epoxide hydrolase 2
(Homo sapiens (Human))
BDBM50446755
(CHEMBL3114608)
Show SMILES O=C(N[C@H]1C[C@@H]1c1ccccc1)N1CCC(CC1)Oc1ccc(cc1)-c1nnn[nH]1 |r|
Show InChI InChI=1S/C22H24N6O2/c29-22(23-20-14-19(20)15-4-2-1-3-5-15)28-12-10-18(11-13-28)30-17-8-6-16(7-9-17)21-24-26-27-25-21/h1-9,18-20H,10-14H2,(H,23,29)(H,24,25,26,27)/t19-,20+/m1/s1
n/an/a 3.30n/an/an/an/an/an/a
Dainippon Sumitomo Pharma Co., Ltd
Curated by ChEMBL
Assay Description
Inhibition of human recombinant soluble epoxide hydrolase after 1 hr by fluorescence assay
Bioorg Med Chem 22: 1548-57 (2014)
Article DOI: 10.1016/j.bmc.2014.01.040
BindingDB Entry DOI: 10.7270/Q22F7PW9
Epoxide hydrolase 2
(Rattus norvegicus)
BDBM50446755
(CHEMBL3114608)
Show SMILES O=C(N[C@H]1C[C@@H]1c1ccccc1)N1CCC(CC1)Oc1ccc(cc1)-c1nnn[nH]1 |r|
Show InChI InChI=1S/C22H24N6O2/c29-22(23-20-14-19(20)15-4-2-1-3-5-15)28-12-10-18(11-13-28)30-17-8-6-16(7-9-17)21-24-26-27-25-21/h1-9,18-20H,10-14H2,(H,23,29)(H,24,25,26,27)/t19-,20+/m1/s1
n/an/a 6.60n/an/an/an/an/an/a
Dainippon Sumitomo Pharma Co., Ltd
Curated by ChEMBL
Assay Description
Inhibition of rat recombinant soluble epoxide hydrolase after 1 hr by fluorescence assay
Bioorg Med Chem 22: 1548-57 (2014)
Article DOI: 10.1016/j.bmc.2014.01.040
BindingDB Entry DOI: 10.7270/Q22F7PW9