BDBM50447216 CHEMBL3113176::US10752581, Compound 46
SMILES: COc1cccc(CNc2ccc(cc2)S(=O)(=O)Nc2cnc3ccccc3c2)c1O
InChI Key: InChIKey=BKYJEYMZCAWAPA-UHFFFAOYSA-N
Data: 2 IC50
Activity Spreadsheet -- Enzyme Inhibition Constant Data from BindingDB
Found 2 hits for monomerid = 50447216
Trg + Lig
Ki
nM
ΔG°
kcal/mole
IC50
nM
Kd
nM
EC50/IC50
nM
koff
s-1
kon
M-1s-1
pHTemp
°C
Arachidonate 12-lipoxygenase
(Homo sapiens (Human))
BDBM50447216
(CHEMBL3113176 | US10752581, Compound 46)
Show SMILES COc1cccc(CNc2ccc(cc2)S(=O)(=O)Nc2cnc3ccccc3c2)c1O
Show InChI InChI=1S/C23H21N3O4S/c1-30-22-8-4-6-17(23(22)27)14-24-18-9-11-20(12-10-18)31(28,29)26-19-13-16-5-2-3-7-21(16)25-15-19/h2-13,15,24,26-27H,14H2,1H3
US Patent
n/an/a 480n/an/an/an/an/an/a
Eastern Virginia Medical School; The Regents of the University of California Santa; The United States of America Department of Health; Thomas Jefferson University
US Patent
Assay Description
UV-vis cuvette-based assay.
US Patent US10752581 (2020)
12-Lipoxygenase (12-LOX)
(Homo sapiens (Human))
BDBM50447216
(CHEMBL3113176 | US10752581, Compound 46)
Show SMILES COc1cccc(CNc2ccc(cc2)S(=O)(=O)Nc2cnc3ccccc3c2)c1O
Show InChI InChI=1S/C23H21N3O4S/c1-30-22-8-4-6-17(23(22)27)14-24-18-9-11-20(12-10-18)31(28,29)26-19-13-16-5-2-3-7-21(16)25-15-19/h2-13,15,24,26-27H,14H2,1H3
n/an/a 480n/an/an/an/an/an/a
National Institutes of Health
Curated by ChEMBL
Assay Description
Inhibition of N-terminal His6-tagged human platelet 12-LOX using arachidonic acid as substrate by UV-vis spectrophotometric analysis
J Med Chem 57: 495-506 (2014)
Article DOI: 10.1021/jm4016476
BindingDB Entry DOI: 10.7270/Q27082XR