BDBM50447296 CHEMBL3114191
SMILES: CCNC(=O)Nc1nc2cc(-c3ccc4ncnn4c3)c(=O)n(C(C)C)c2s1
InChI Key: InChIKey=PZENHOQOINDFGF-UHFFFAOYSA-N
Data: 1 IC50
Activity Spreadsheet -- Enzyme Inhibition Constant Data from BindingDB
Found 1 hit for monomerid = 50447296
Trg + Lig
Ki
nM
ΔG°
kcal/mole
IC50
nM
Kd
nM
EC50/IC50
nM
koff
s-1
kon
M-1s-1
pHTemp
°C
DNA gyrase subunit B
(Mycobacterium smegmatis)
BDBM50447296
(CHEMBL3114191)
Show SMILES CCNC(=O)Nc1nc2cc(-c3ccc4ncnn4c3)c(=O)n(C(C)C)c2s1
Show InChI InChI=1S/C18H19N7O2S/c1-4-19-17(27)23-18-22-13-7-12(15(26)25(10(2)3)16(13)28-18)11-5-6-14-20-9-21-24(14)8-11/h5-10H,4H2,1-3H3,(H2,19,22,23,27)
n/an/a 11n/an/an/an/an/an/a
AstraZeneca
Curated by ChEMBL
Assay Description
Inhibition of Mycobacterium smegmatis DNA gyrase B ATPase activity after 100 mins
Bioorg Med Chem Lett 24: 870-9 (2014)
Article DOI: 10.1016/j.bmcl.2013.12.080
BindingDB Entry DOI: 10.7270/Q2K9390V