BDBM50447302 CHEMBL3114204
SMILES: CCNC(=O)Nc1nc2cc(-c3ccc(nc3)-c3nnnn3C)c(=O)n(C(C)C)c2s1
InChI Key: InChIKey=PHWSEHLIXFUKOW-UHFFFAOYSA-N
Data: 1 IC50
Activity Spreadsheet -- Enzyme Inhibition Constant Data from BindingDB
Found 1 hit for monomerid = 50447302
Trg + Lig
Ki
nM
ΔG°
kcal/mole
IC50
nM
Kd
nM
EC50/IC50
nM
koff
s-1
kon
M-1s-1
pHTemp
°C
DNA gyrase subunit B
(Mycobacterium smegmatis)
BDBM50447302
(CHEMBL3114204)
Show SMILES CCNC(=O)Nc1nc2cc(-c3ccc(nc3)-c3nnnn3C)c(=O)n(C(C)C)c2s1
Show InChI InChI=1S/C19H21N9O2S/c1-5-20-18(30)23-19-22-14-8-12(16(29)28(10(2)3)17(14)31-19)11-6-7-13(21-9-11)15-24-25-26-27(15)4/h6-10H,5H2,1-4H3,(H2,20,22,23,30)
n/an/a 20n/an/an/an/an/an/a
AstraZeneca
Curated by ChEMBL
Assay Description
Inhibition of Mycobacterium smegmatis DNA gyrase B ATPase activity after 100 mins
Bioorg Med Chem Lett 24: 870-9 (2014)
Article DOI: 10.1016/j.bmcl.2013.12.080
BindingDB Entry DOI: 10.7270/Q2K9390V