BDBM50447303 CHEMBL3114202
SMILES: CCNC(=O)Nc1nc2cc(-c3cncc(c3)C#N)c(=O)n(C(C)C)c2s1
InChI Key: InChIKey=LGFKSIAROJRJDY-UHFFFAOYSA-N
Data: 1 IC50
Activity Spreadsheet -- Enzyme Inhibition Constant Data from BindingDB
Found 1 hit for monomerid = 50447303
Trg + Lig
Ki
nM
ΔG°
kcal/mole
IC50
nM
Kd
nM
EC50/IC50
nM
koff
s-1
kon
M-1s-1
pHTemp
°C
DNA gyrase subunit B
(Mycobacterium smegmatis)
BDBM50447303
(CHEMBL3114202)
Show SMILES CCNC(=O)Nc1nc2cc(-c3cncc(c3)C#N)c(=O)n(C(C)C)c2s1
Show InChI InChI=1S/C18H18N6O2S/c1-4-21-17(26)23-18-22-14-6-13(12-5-11(7-19)8-20-9-12)15(25)24(10(2)3)16(14)27-18/h5-6,8-10H,4H2,1-3H3,(H2,21,22,23,26)
n/an/a 4n/an/an/an/an/an/a
AstraZeneca
Curated by ChEMBL
Assay Description
Inhibition of Mycobacterium smegmatis DNA gyrase B ATPase activity after 100 mins
Bioorg Med Chem Lett 24: 870-9 (2014)
Article DOI: 10.1016/j.bmcl.2013.12.080
BindingDB Entry DOI: 10.7270/Q2K9390V