BDBM50447347 CHEMBL3114474
SMILES: CC(C)(C)CCN1C(SC(CC(=O)N2CCC(CC2)N2Cc3ccccc3NC2=O)C1=O)c1ccccc1N1CCNCC1
InChI Key: InChIKey=AJSPOSFNOAHUJQ-UHFFFAOYSA-N
Data: 1 KI  1 IC50
Activity Spreadsheet -- Enzyme Inhibition Constant Data from BindingDB
Found 2 hits for monomerid = 50447347
Trg + Lig
Ki
nM
ΔG°
kcal/mole
IC50
nM
Kd
nM
EC50/IC50
nM
koff
s-1
kon
M-1s-1
pHTemp
°C
Calcitonin gene-related peptide type 1 receptor
(Homo sapiens (Human))
BDBM50447347
(CHEMBL3114474)
Show SMILES CC(C)(C)CCN1C(SC(CC(=O)N2CCC(CC2)N2Cc3ccccc3NC2=O)C1=O)c1ccccc1N1CCNCC1
Show InChI InChI=1S/C34H46N6O3S/c1-34(2,3)14-19-39-31(42)29(44-32(39)26-9-5-7-11-28(26)37-20-15-35-16-21-37)22-30(41)38-17-12-25(13-18-38)40-23-24-8-4-6-10-27(24)36-33(40)43/h4-11,25,29,32,35H,12-23H2,1-3H3,(H,36,43)
Reactome pathway
2n/an/an/an/an/an/an/an/a
Vertex Pharmaceuticals Inc.
Curated by ChEMBL
Assay Description
Displacement of [125I]CGRP from CGRP receptor in human SK-N-MC cell membranes preincubated for 30 mins followed by radioligand addition measured afte...
Bioorg Med Chem Lett 24: 845-9 (2014)
Article DOI: 10.1016/j.bmcl.2013.12.089
BindingDB Entry DOI: 10.7270/Q2FJ2J84
Calcitonin gene-related peptide type 1 receptor
(Homo sapiens (Human))
BDBM50447347
(CHEMBL3114474)
Show SMILES CC(C)(C)CCN1C(SC(CC(=O)N2CCC(CC2)N2Cc3ccccc3NC2=O)C1=O)c1ccccc1N1CCNCC1
Show InChI InChI=1S/C34H46N6O3S/c1-34(2,3)14-19-39-31(42)29(44-32(39)26-9-5-7-11-28(26)37-20-15-35-16-21-37)22-30(41)38-17-12-25(13-18-38)40-23-24-8-4-6-10-27(24)36-33(40)43/h4-11,25,29,32,35H,12-23H2,1-3H3,(H,36,43)
Reactome pathway
n/an/a 60n/an/an/an/an/an/a
Vertex Pharmaceuticals Inc.
Curated by ChEMBL
Assay Description
Antagonist activity at CGRP receptor in human SK-N-MC cells assessed as inhibition of CGRP-stimulated cAMP production preincubated for 30 mins follow...
Bioorg Med Chem Lett 24: 845-9 (2014)
Article DOI: 10.1016/j.bmcl.2013.12.089
BindingDB Entry DOI: 10.7270/Q2FJ2J84