BDBM50447560 CHEMBL3116399
SMILES: O=C(Nc1cccnc1)c1ccc2n(CC3CCN(CC3)C(=O)c3ccccc3)cnc2c1
InChI Key: InChIKey=UROBXDPDOFZURE-UHFFFAOYSA-N
Data: 2 IC50
PDB links: 1 PDB ID matches this monomer.
Activity Spreadsheet -- Enzyme Inhibition Constant Data from BindingDB
Found 2 hits for monomerid = 50447560
Trg + Lig
Ki
nM
ΔG°
kcal/mole
IC50
nM
Kd
nM
EC50/IC50
nM
koff
s-1
kon
M-1s-1
pHTemp
°C
Nicotinamide phosphoribosyltransferase
(Homo sapiens (Human))
BDBM50447560
(CHEMBL3116399)
Show SMILES O=C(Nc1cccnc1)c1ccc2n(CC3CCN(CC3)C(=O)c3ccccc3)cnc2c1
Show InChI InChI=1S/C26H25N5O2/c32-25(29-22-7-4-12-27-16-22)21-8-9-24-23(15-21)28-18-31(24)17-19-10-13-30(14-11-19)26(33)20-5-2-1-3-6-20/h1-9,12,15-16,18-19H,10-11,13-14,17H2,(H,29,32)
Reactome pathway
n/an/a 15n/an/an/an/an/an/a
Genentech
Curated by ChEMBL
Assay Description
Inhibition of full length C-terminal His6-tagged human NAMPT expressed in Escherichia coli Rosetta (DE3) cells using PRPP/NAM as substrate/cofactor p...
Bioorg Med Chem Lett 24: 954-62 (2014)
Article DOI: 10.1016/j.bmcl.2013.12.062
BindingDB Entry DOI: 10.7270/Q2RV0Q50
3D
3D Structure (crystal)
Nicotinamide phosphoribosyltransferase
(Homo sapiens (Human))
BDBM50447560
(CHEMBL3116399)
Show SMILES O=C(Nc1cccnc1)c1ccc2n(CC3CCN(CC3)C(=O)c3ccccc3)cnc2c1
Show InChI InChI=1S/C26H25N5O2/c32-25(29-22-7-4-12-27-16-22)21-8-9-24-23(15-21)28-18-31(24)17-19-10-13-30(14-11-19)26(33)20-5-2-1-3-6-20/h1-9,12,15-16,18-19H,10-11,13-14,17H2,(H,29,32)
Reactome pathway
n/an/a>1.00E+3n/an/an/an/an/an/a
Genentech
Curated by ChEMBL
Assay Description
Inhibition of NAMPT in human A2780 cells assessed as reduction in NAD level after 48 hrs by LC-MS/MS analysis
Bioorg Med Chem Lett 24: 954-62 (2014)
Article DOI: 10.1016/j.bmcl.2013.12.062
BindingDB Entry DOI: 10.7270/Q2RV0Q50
3D
3D Structure (crystal)