BDBM50447751 CHEMBL3113268
SMILES: Fc1ccc(c(F)c1)-c1ccnc(c1)N1CCN(CC1)C(=O)Nc1cccnn1
InChI Key: InChIKey=KBNXOJQSWKFIGN-UHFFFAOYSA-N
Data: 2 IC50
Activity Spreadsheet -- Enzyme Inhibition Constant Data from BindingDB
Found 2 hits for monomerid = 50447751
Trg + Lig
Ki
nM
ΔG°
kcal/mole
IC50
nM
Kd
nM
EC50/IC50
nM
koff
s-1
kon
M-1s-1
pHTemp
°C
Fatty-acid amide hydrolase 1
(Homo sapiens (Human))
BDBM50447751
(CHEMBL3113268)
Show SMILES Fc1ccc(c(F)c1)-c1ccnc(c1)N1CCN(CC1)C(=O)Nc1cccnn1
Show InChI InChI=1S/C20H18F2N6O/c21-15-3-4-16(17(22)13-15)14-5-7-23-19(12-14)27-8-10-28(11-9-27)20(29)25-18-2-1-6-24-26-18/h1-7,12-13H,8-11H2,(H,25,26,29)
n/an/a 2.20n/an/an/an/an/an/a
Takeda Pharmaceutical Company Ltd
Curated by ChEMBL
Assay Description
Apparent inhibition of human FAAH expressed in CHOK1 cells using AMCAA as substrate after 30 mins by fluorescence assay
Bioorg Med Chem 22: 1468-78 (2014)
Article DOI: 10.1016/j.bmc.2013.12.023
BindingDB Entry DOI: 10.7270/Q20C4X77
Fatty-acid amide hydrolase 1 (aa 30-579)
(Rattus norvegicus (rat))
BDBM50447751
(CHEMBL3113268)
Show SMILES Fc1ccc(c(F)c1)-c1ccnc(c1)N1CCN(CC1)C(=O)Nc1cccnn1
Show InChI InChI=1S/C20H18F2N6O/c21-15-3-4-16(17(22)13-15)14-5-7-23-19(12-14)27-8-10-28(11-9-27)20(29)25-18-2-1-6-24-26-18/h1-7,12-13H,8-11H2,(H,25,26,29)
n/an/a 4.30n/an/an/an/an/an/a
Takeda Pharmaceutical Company Ltd
Curated by ChEMBL
Assay Description
Apparent inhibition of rat FAAH using AMCAA as substrate after 30 mins by fluorescence assay
Bioorg Med Chem 22: 1468-78 (2014)
Article DOI: 10.1016/j.bmc.2013.12.023
BindingDB Entry DOI: 10.7270/Q20C4X77