null
SMILES: Cc1ccc2nc([nH]c2c1)-n1[nH]c(c(-c2ccccc2)c1=O)-c1ccccc1
InChI Key: InChIKey=YRKBTEOPVVYBAP-UHFFFAOYSA-N
Activity Spreadsheet -- Enzyme Inhibition Constant Data from BindingDB
Found 1 hit for monomerid = 50447927
Trg + Lig
Ki
nM
ΔG°
kcal/mole
IC50
nM
Kd
nM
EC50/IC50
nM
koff
s-1
kon
M-1s-1
pHTemp
°C
Alpha-ketoglutarate-dependent dioxygenase alkB homolog 3
(Homo sapiens (Human))
BDBM50447927
(CHEMBL3114991)
Show SMILES Cc1ccc2nc([nH]c2c1)-n1[nH]c(c(-c2ccccc2)c1=O)-c1ccccc1
Show InChI InChI=1S/C23H18N4O/c1-15-12-13-18-19(14-15)25-23(24-18)27-22(28)20(16-8-4-2-5-9-16)21(26-27)17-10-6-3-7-11-17/h2-14,26H,1H3,(H,24,25)
Reactome pathway
n/an/a 5.80E+3n/an/an/an/an/an/a
Hyogo University of Health Science
Curated by ChEMBL
Assay Description
Inhibition of demethylase activity of PCA-1 (unknown origin) using 3-methyl cytosine oligo DNA as substrate after 1 hr by RT-PCR analysis
Bioorg Med Chem Lett 24: 1071-4 (2014)
Article DOI: 10.1016/j.bmcl.2014.01.008
BindingDB Entry DOI: 10.7270/Q2FF3TVD