BDBM50447935 CHEMBL3114989
SMILES: Cc1c([nH]n(-c2nc3ccc(C)cc3[nH]2)c1=O)-c1ccccc1
InChI Key: InChIKey=XBMFBFSDFZLCCZ-UHFFFAOYSA-N
Data: 1 IC50
Activity Spreadsheet -- Enzyme Inhibition Constant Data from BindingDB
Found 1 hit for monomerid = 50447935
Trg + Lig
Ki
nM
ΔG°
kcal/mole
IC50
nM
Kd
nM
EC50/IC50
nM
koff
s-1
kon
M-1s-1
pHTemp
°C
Alpha-ketoglutarate-dependent dioxygenase alkB homolog 3
(Homo sapiens (Human))
BDBM50447935
(CHEMBL3114989)
Show SMILES Cc1c([nH]n(-c2nc3ccc(C)cc3[nH]2)c1=O)-c1ccccc1
Show InChI InChI=1S/C18H16N4O/c1-11-8-9-14-15(10-11)20-18(19-14)22-17(23)12(2)16(21-22)13-6-4-3-5-7-13/h3-10,21H,1-2H3,(H,19,20)
Reactome pathway
n/an/a 3.30E+3n/an/an/an/an/an/a
Hyogo University of Health Science
Curated by ChEMBL
Assay Description
Inhibition of demethylase activity of PCA-1 (unknown origin) using 3-methyl cytosine oligo DNA as substrate after 1 hr by RT-PCR analysis
Bioorg Med Chem Lett 24: 1071-4 (2014)
Article DOI: 10.1016/j.bmcl.2014.01.008
BindingDB Entry DOI: 10.7270/Q2FF3TVD