null
SMILES: CCCc1nn2ccc(cc2c1Cc1ccc(cc1)-c1ccccc1C(O)=O)-c1nc2ccccc2n1CCC
InChI Key: InChIKey=MQQYKWVMSLKOLR-UHFFFAOYSA-N
Activity Spreadsheet -- Enzyme Inhibition Constant Data from BindingDB
Found 3 hits for monomerid = 50448024
Trg + Lig
Ki
nM
ΔG°
kcal/mole
IC50
nM
Kd
nM
EC50/IC50
nM
koff
s-1
kon
M-1s-1
pHTemp
°C
Peroxisome proliferator-activated receptor delta
(Mus musculus)
BDBM50448024
(CHEMBL3115242)
Show SMILES CCCc1nn2ccc(cc2c1Cc1ccc(cc1)-c1ccccc1C(O)=O)-c1nc2ccccc2n1CCC
Show InChI InChI=1S/C34H32N4O2/c1-3-9-29-28(21-23-14-16-24(17-15-23)26-10-5-6-11-27(26)34(39)40)32-22-25(18-20-38(32)36-29)33-35-30-12-7-8-13-31(30)37(33)19-4-2/h5-8,10-18,20,22H,3-4,9,19,21H2,1-2H3,(H,39,40)
Reactome pathway
n/an/an/an/a>1.00E+4n/an/an/an/a
GlaxoSmithKline R&D
Curated by ChEMBL
Assay Description
Agonist activity at mouse PPARdelta expressed in CV-1 cells by reporter gene assay
Bioorg Med Chem Lett 24: 1098-103 (2014)
Article DOI: 10.1016/j.bmcl.2014.01.004
BindingDB Entry DOI: 10.7270/Q2SQ91V1
Peroxisome proliferator-activated receptor gamma
(Mus musculus)
BDBM50448024
(CHEMBL3115242)
Show SMILES CCCc1nn2ccc(cc2c1Cc1ccc(cc1)-c1ccccc1C(O)=O)-c1nc2ccccc2n1CCC
Show InChI InChI=1S/C34H32N4O2/c1-3-9-29-28(21-23-14-16-24(17-15-23)26-10-5-6-11-27(26)34(39)40)32-22-25(18-20-38(32)36-29)33-35-30-12-7-8-13-31(30)37(33)19-4-2/h5-8,10-18,20,22H,3-4,9,19,21H2,1-2H3,(H,39,40)
Reactome pathway
n/an/an/an/a 380n/an/an/an/a
GlaxoSmithKline R&D
Curated by ChEMBL
Assay Description
Agonist activity at mouse PPARgamma expressed in CV-1 cells by reporter gene assay
Bioorg Med Chem Lett 24: 1098-103 (2014)
Article DOI: 10.1016/j.bmcl.2014.01.004
BindingDB Entry DOI: 10.7270/Q2SQ91V1
Peroxisome proliferator-activated receptor alpha
(Mus musculus)
BDBM50448024
(CHEMBL3115242)
Show SMILES CCCc1nn2ccc(cc2c1Cc1ccc(cc1)-c1ccccc1C(O)=O)-c1nc2ccccc2n1CCC
Show InChI InChI=1S/C34H32N4O2/c1-3-9-29-28(21-23-14-16-24(17-15-23)26-10-5-6-11-27(26)34(39)40)32-22-25(18-20-38(32)36-29)33-35-30-12-7-8-13-31(30)37(33)19-4-2/h5-8,10-18,20,22H,3-4,9,19,21H2,1-2H3,(H,39,40)
Reactome pathway
n/an/an/an/a>1.00E+4n/an/an/an/a
GlaxoSmithKline R&D
Curated by ChEMBL
Assay Description
Agonist activity at mouse PPARalpha expressed in CV-1 cells by reporter gene assay
Bioorg Med Chem Lett 24: 1098-103 (2014)
Article DOI: 10.1016/j.bmcl.2014.01.004
BindingDB Entry DOI: 10.7270/Q2SQ91V1