BDBM50448094 CHEMBL3121314
SMILES: Nc1ncc(cc1NS(=O)(=O)c1ccc(F)cc1F)-c1ccc2nc(N)n(-c3ccccc3)c(=O)c2c1
InChI Key: InChIKey=CLOKBSMLMXZYDH-UHFFFAOYSA-N
Data: 1 IC50
Activity Spreadsheet -- Enzyme Inhibition Constant Data from BindingDB
Found 1 hit for monomerid = 50448094
Trg + Lig
Ki
nM
ΔG°
kcal/mole
IC50
nM
Kd
nM
EC50/IC50
nM
koff
s-1
kon
M-1s-1
pHTemp
°C
Phosphatidylinositol 4-kinase alpha (PI4KA)
(Homo sapiens (Human))
BDBM50448094
(CHEMBL3121314)
Show SMILES Nc1ncc(cc1NS(=O)(=O)c1ccc(F)cc1F)-c1ccc2nc(N)n(-c3ccccc3)c(=O)c2c1
Show InChI InChI=1S/C25H18F2N6O3S/c26-16-7-9-22(19(27)12-16)37(35,36)32-21-11-15(13-30-23(21)28)14-6-8-20-18(10-14)24(34)33(25(29)31-20)17-4-2-1-3-5-17/h1-13,32H,(H2,28,30)(H2,29,31)
n/an/a 0.794n/an/an/an/an/an/a
GlaxoSmithKline
Curated by ChEMBL
Assay Description
Inhibition of GST-tagged PI4K-alpha (1 to 2044) (unknown origin) using D-myo-phosphatidylinositol as substrate preincubated for 30 mins followed by s...
J Med Chem 57: 2091-106 (2014)
Article DOI: 10.1021/jm400781h
BindingDB Entry DOI: 10.7270/Q2WH2RG0