BDBM50448099 CHEMBL3121331
SMILES: COc1ncc(cc1NS(=O)(=O)c1ccc(F)cc1F)-c1cc2cc(c(N)nc2cn1)-c1ccccc1
InChI Key: InChIKey=ABEDHXMOGHHQTM-UHFFFAOYSA-N
Data: 2 IC50
Activity Spreadsheet -- Enzyme Inhibition Constant Data from BindingDB
Found 2 hits for monomerid = 50448099
Trg + Lig
Ki
nM
ΔG°
kcal/mole
IC50
nM
Kd
nM
EC50/IC50
nM
koff
s-1
kon
M-1s-1
pHTemp
°C
Phosphatidylinositol 4,5-bisphosphate 3-kinase catalytic subunit gamma isoform
(Homo sapiens (Human))
BDBM50448099
(CHEMBL3121331)
Show SMILES COc1ncc(cc1NS(=O)(=O)c1ccc(F)cc1F)-c1cc2cc(c(N)nc2cn1)-c1ccccc1
Show InChI InChI=1S/C26H19F2N5O3S/c1-36-26-22(33-37(34,35)24-8-7-18(27)12-20(24)28)11-17(13-31-26)21-10-16-9-19(15-5-3-2-4-6-15)25(29)32-23(16)14-30-21/h2-14,33H,1H3,(H2,29,32)
NCI pathway
Reactome pathway
n/an/a 1.26E+3n/an/an/an/an/an/a
GlaxoSmithKline
Curated by ChEMBL
Assay Description
Inhibition of PI3Kgamma (2 to 1102) (unknown origin) using diC8-PIP2 as substrate preincubated for 30 mins followed by substrate addition measured af...
J Med Chem 57: 2091-106 (2014)
Article DOI: 10.1021/jm400781h
BindingDB Entry DOI: 10.7270/Q2WH2RG0
Phosphatidylinositol 4-kinase alpha (PI4KA)
(Homo sapiens (Human))
BDBM50448099
(CHEMBL3121331)
Show SMILES COc1ncc(cc1NS(=O)(=O)c1ccc(F)cc1F)-c1cc2cc(c(N)nc2cn1)-c1ccccc1
Show InChI InChI=1S/C26H19F2N5O3S/c1-36-26-22(33-37(34,35)24-8-7-18(27)12-20(24)28)11-17(13-31-26)21-10-16-9-19(15-5-3-2-4-6-15)25(29)32-23(16)14-30-21/h2-14,33H,1H3,(H2,29,32)
n/an/a 200n/an/an/an/an/an/a
GlaxoSmithKline
Curated by ChEMBL
Assay Description
Inhibition of GST-tagged PI4K-alpha (1 to 2044) (unknown origin) using D-myo-phosphatidylinositol as substrate preincubated for 30 mins followed by s...
J Med Chem 57: 2091-106 (2014)
Article DOI: 10.1021/jm400781h
BindingDB Entry DOI: 10.7270/Q2WH2RG0