BDBM50448100 CHEMBL3121330
SMILES: COc1ncc(cc1NS(=O)(=O)c1ccc(F)cc1F)-c1cnc2nc(N)c(cc2c1)-c1ccccc1
InChI Key: InChIKey=SBYFOHJJQOLDEW-UHFFFAOYSA-N
Data: 2 IC50
Activity Spreadsheet -- Enzyme Inhibition Constant Data from BindingDB
Found 2 hits for monomerid = 50448100
Trg + Lig
Ki
nM
ΔG°
kcal/mole
IC50
nM
Kd
nM
EC50/IC50
nM
koff
s-1
kon
M-1s-1
pHTemp
°C
Phosphatidylinositol 4,5-bisphosphate 3-kinase catalytic subunit gamma isoform
(Homo sapiens (Human))
BDBM50448100
(CHEMBL3121330)
Show SMILES COc1ncc(cc1NS(=O)(=O)c1ccc(F)cc1F)-c1cnc2nc(N)c(cc2c1)-c1ccccc1
Show InChI InChI=1S/C26H19F2N5O3S/c1-36-26-22(33-37(34,35)23-8-7-19(27)12-21(23)28)11-18(14-31-26)17-9-16-10-20(15-5-3-2-4-6-15)24(29)32-25(16)30-13-17/h2-14,33H,1H3,(H2,29,30,32)
NCI pathway
Reactome pathway
n/an/a 6.31E+3n/an/an/an/an/an/a
GlaxoSmithKline
Curated by ChEMBL
Assay Description
Inhibition of PI3Kgamma (2 to 1102) (unknown origin) using diC8-PIP2 as substrate preincubated for 30 mins followed by substrate addition measured af...
J Med Chem 57: 2091-106 (2014)
Article DOI: 10.1021/jm400781h
BindingDB Entry DOI: 10.7270/Q2WH2RG0
Phosphatidylinositol 4-kinase alpha (PI4KA)
(Homo sapiens (Human))
BDBM50448100
(CHEMBL3121330)
Show SMILES COc1ncc(cc1NS(=O)(=O)c1ccc(F)cc1F)-c1cnc2nc(N)c(cc2c1)-c1ccccc1
Show InChI InChI=1S/C26H19F2N5O3S/c1-36-26-22(33-37(34,35)23-8-7-19(27)12-21(23)28)11-18(14-31-26)17-9-16-10-20(15-5-3-2-4-6-15)24(29)32-25(16)30-13-17/h2-14,33H,1H3,(H2,29,30,32)
n/an/a 631n/an/an/an/an/an/a
GlaxoSmithKline
Curated by ChEMBL
Assay Description
Inhibition of GST-tagged PI4K-alpha (1 to 2044) (unknown origin) using D-myo-phosphatidylinositol as substrate preincubated for 30 mins followed by s...
J Med Chem 57: 2091-106 (2014)
Article DOI: 10.1021/jm400781h
BindingDB Entry DOI: 10.7270/Q2WH2RG0