null
SMILES: Cc1ccc(C)c(NC(=S)Nc2cccc(Cl)c2)c1
InChI Key: InChIKey=XHTDRWXFACLUDB-UHFFFAOYSA-N
Activity Spreadsheet -- Enzyme Inhibition Constant Data from BindingDB
Found 2 hits for monomerid = 50448185
Trg + Lig
Ki
nM
ΔG°
kcal/mole
IC50
nM
Kd
nM
EC50/IC50
nM
koff
s-1
kon
M-1s-1
pHTemp
°C
Urease
(Canavalia ensiformis (Jack bean) (Horse bean))
BDBM50448185
(CHEMBL3120566)
Show SMILES Cc1ccc(C)c(NC(=S)Nc2cccc(Cl)c2)c1
Show InChI InChI=1S/C15H15ClN2S/c1-10-6-7-11(2)14(8-10)18-15(19)17-13-5-3-4-12(16)9-13/h3-9H,1-2H3,(H2,17,18,19)
1.93E+4n/an/an/an/an/an/an/an/a
University Karachi
Curated by ChEMBL
Assay Description
Mixed-type inhibition of jack bean urease using urea as substrate assessed as ammonia production after 15 mins by Lineweaver-Burk/Dixon plot analysis
Eur J Med Chem 74: 314-23 (2014)
Article DOI: 10.1016/j.ejmech.2014.01.001
BindingDB Entry DOI: 10.7270/Q2VH5QBM
Urease
(Canavalia ensiformis (Jack bean) (Horse bean))
BDBM50448185
(CHEMBL3120566)
Show SMILES Cc1ccc(C)c(NC(=S)Nc2cccc(Cl)c2)c1
Show InChI InChI=1S/C15H15ClN2S/c1-10-6-7-11(2)14(8-10)18-15(19)17-13-5-3-4-12(16)9-13/h3-9H,1-2H3,(H2,17,18,19)
n/an/a 2.09E+4n/an/an/an/an/an/a
University Karachi
Curated by ChEMBL
Assay Description
Inhibition of jack bean urease using urea as substrate assessed as ammonia production after 15 mins by indophenol method
Eur J Med Chem 74: 314-23 (2014)
Article DOI: 10.1016/j.ejmech.2014.01.001
BindingDB Entry DOI: 10.7270/Q2VH5QBM