BDBM50448382 CHEMBL3121719
SMILES: OC[C@H]1O[C@H](OCC(COc2ccc3ccccc3c2)Oc2ccc3ccccc3c2)[C@@H](O)[C@@H](O)[C@@H]1O
InChI Key: InChIKey=NBDTZUYTNXHJOL-MJYFDKBTSA-N
Data: 1 IC50
Activity Spreadsheet -- Enzyme Inhibition Constant Data from BindingDB
Found 1 hit for monomerid = 50448382
Trg + Lig
Ki
nM
ΔG°
kcal/mole
IC50
nM
Kd
nM
EC50/IC50
nM
koff
s-1
kon
M-1s-1
pHTemp
°C
CD209 antigen
(Homo sapiens (Human))
BDBM50448382
(CHEMBL3121719)
Show SMILES OC[C@H]1O[C@H](OCC(COc2ccc3ccccc3c2)Oc2ccc3ccccc3c2)[C@@H](O)[C@@H](O)[C@@H]1O |r|
Show InChI InChI=1S/C29H30O8/c30-15-25-26(31)27(32)28(33)29(37-25)35-17-24(36-23-12-10-19-6-2-4-8-21(19)14-23)16-34-22-11-9-18-5-1-3-7-20(18)13-22/h1-14,24-33H,15-17H2/t24?,25-,26-,27+,28+,29+/m1/s1
n/an/a 3.95E+5n/an/an/an/an/an/a
University of Ljubljana
Curated by ChEMBL
Assay Description
Displacement of biotinylated HIV1 gp120 from DC-SIGN receptor carbohydrate recognition domain (unknown origin) after 2 hrs by solid-phase competitive...
Eur J Med Chem 75: 308-26 (2014)
Article DOI: 10.1016/j.ejmech.2014.01.047
BindingDB Entry DOI: 10.7270/Q29K4CQR