BDBM50448437 CHEMBL3122151::Oleate
SMILES: CCCCCCCC\C=C/CCCCCCCC([O-])=O
InChI Key: InChIKey=ZQPPMHVWECSIRJ-KTKRTIGZSA-M
Data: 2 KI  2 Kd
Activity Spreadsheet -- Enzyme Inhibition Constant Data from BindingDB
Found 4 hits for monomerid = 50448437
Trg + Lig
Ki
nM
ΔG°
kcal/mole
IC50
nM
Kd
nM
EC50/IC50
nM
koff
s-1
kon
M-1s-1
pHTemp
°C
Intestinal fatty acid-binding protein (hIFABP)
(Homo sapiens (Human))
BDBM50448437
(CHEMBL3122151 | Oleate)
Show SMILES CCCCCCCC\C=C/CCCCCCCC([O-])=O
Show InChI InChI=1S/C18H34O2/c1-2-3-4-5-6-7-8-9-10-11-12-13-14-15-16-17-18(19)20/h9-10H,2-8,11-17H2,1H3,(H,19,20)/p-1/b10-9-
10 -20.7n/an/an/an/an/an/a293.15
Monash University
Assay Description
Briefly, steady-state fluorescence spectra of ANS binding was monitored by measuring the increase in fluorescence signal between 450?550 nm following...
ACS Chem Biol 9: 2526-34 (2014)
Article DOI: 10.1021/cb5005178
BindingDB Entry DOI: 10.7270/Q2348J4C
Cytochrome P450 1A2
(Rattus norvegicus)
BDBM50448437
(CHEMBL3122151 | Oleate)
Show SMILES CCCCCCCC\C=C/CCCCCCCC([O-])=O
Show InChI InChI=1S/C18H34O2/c1-2-3-4-5-6-7-8-9-10-11-12-13-14-15-16-17-18(19)20/h9-10H,2-8,11-17H2,1H3,(H,19,20)/p-1/b10-9-
Reactome pathway
1.67E+4n/an/an/an/an/an/an/an/a
Khon Kaen University
Curated by ChEMBL
Assay Description
Competitive inhibition of rat recombinant CYP1A2 expressed in Escherichia coli assessed as inhibition of PHEN O-deethylation by dixon plot analysis
Drug Metab Dispos 40: 982-9 (2012)
Article DOI: 10.1124/dmd.111.044057
BindingDB Entry DOI: 10.7270/Q2MS3VGW
Fatty acid binding protein muscle
(Homo sapiens (Human))
BDBM50448437
(CHEMBL3122151 | Oleate)
Show SMILES CCCCCCCC\C=C/CCCCCCCC([O-])=O
Show InChI InChI=1S/C18H34O2/c1-2-3-4-5-6-7-8-9-10-11-12-13-14-15-16-17-18(19)20/h9-10H,2-8,11-17H2,1H3,(H,19,20)/p-1/b10-9-
n/an/an/a 159n/an/an/an/an/a
Osaka University
Curated by ChEMBL
Assay Description
Binding affinity to human FABP3 expressed in Escherichia coli BL21 (DE3) at 10 uM in DMPC liposomes by surface plasmon resonance analysis
Bioorg Med Chem 22: 1804-8 (2014)
Article DOI: 10.1016/j.bmc.2014.02.001
BindingDB Entry DOI: 10.7270/Q2SJ1N49
Fatty acid binding protein muscle
(Homo sapiens (Human))
BDBM50448437
(CHEMBL3122151 | Oleate)
Show SMILES CCCCCCCC\C=C/CCCCCCCC([O-])=O
Show InChI InChI=1S/C18H34O2/c1-2-3-4-5-6-7-8-9-10-11-12-13-14-15-16-17-18(19)20/h9-10H,2-8,11-17H2,1H3,(H,19,20)/p-1/b10-9-
n/an/an/a 7.33E+4n/an/an/an/an/a
Osaka University
Curated by ChEMBL
Assay Description
Binding affinity to human FABP3 expressed in Escherichia coli BL21 (DE3) at 60 uM by surface plasmon resonance analysis
Bioorg Med Chem 22: 1804-8 (2014)
Article DOI: 10.1016/j.bmc.2014.02.001
BindingDB Entry DOI: 10.7270/Q2SJ1N49