BDBM50448488 CHEMBL3126652
SMILES: Cc1cc(Nc2ccc(NC(=O)c3ccc(Nc4cc(C)nc(N)n4)cc3)cc2)nc(N)n1
InChI Key: InChIKey=HQIGTSYWJONWMK-UHFFFAOYSA-N
Data: 3 IC50
Activity Spreadsheet -- Enzyme Inhibition Constant Data from BindingDB
Found 3 hits for monomerid = 50448488
Trg + Lig
Ki
nM
ΔG°
kcal/mole
IC50
nM
Kd
nM
EC50/IC50
nM
koff
s-1
kon
M-1s-1
pHTemp
°C
DNMT3A2/3L complex
(Homo sapiens (Human))
BDBM50448488
(CHEMBL3126652)
Show SMILES Cc1cc(Nc2ccc(NC(=O)c3ccc(Nc4cc(C)nc(N)n4)cc3)cc2)nc(N)n1
Show InChI InChI=1S/C23H23N9O/c1-13-11-19(31-22(24)26-13)28-16-5-3-15(4-6-16)21(33)30-18-9-7-17(8-10-18)29-20-12-14(2)27-23(25)32-20/h3-12H,1-2H3,(H,30,33)(H3,24,26,28,31)(H3,25,27,29,32)
n/an/a 1.80E+4n/an/an/an/an/an/a
Sapienza Universit£ di Roma
Curated by ChEMBL
Assay Description
Inhibition of human DNMT3A2/3L using unmethylated DNA as substrate in presence of [methyl-3H]-AdoMet
J Med Chem 57: 701-13 (2014)
Article DOI: 10.1021/jm4012627
BindingDB Entry DOI: 10.7270/Q2028T1Q
DNA (cytosine-5)-methyltransferase 1 (DNMT1)
(Homo sapiens (Human))
BDBM50448488
(CHEMBL3126652)
Show SMILES Cc1cc(Nc2ccc(NC(=O)c3ccc(Nc4cc(C)nc(N)n4)cc3)cc2)nc(N)n1
Show InChI InChI=1S/C23H23N9O/c1-13-11-19(31-22(24)26-13)28-16-5-3-15(4-6-16)21(33)30-18-9-7-17(8-10-18)29-20-12-14(2)27-23(25)32-20/h3-12H,1-2H3,(H,30,33)(H3,24,26,28,31)(H3,25,27,29,32)
n/an/a 2.23E+3n/an/an/an/an/an/a
Sapienza Universit£ di Roma
Curated by ChEMBL
Assay Description
Inhibition of human N-terminal 600 residues-deleted DNMT1 using poly(dI-dC) as substrate in presence of AdoMet
J Med Chem 57: 701-13 (2014)
Article DOI: 10.1021/jm4012627
BindingDB Entry DOI: 10.7270/Q2028T1Q
DNA (cytosine-5)-methyltransferase 1 (DNMT1)
(Homo sapiens (Human))
BDBM50448488
(CHEMBL3126652)
Show SMILES Cc1cc(Nc2ccc(NC(=O)c3ccc(Nc4cc(C)nc(N)n4)cc3)cc2)nc(N)n1
Show InChI InChI=1S/C23H23N9O/c1-13-11-19(31-22(24)26-13)28-16-5-3-15(4-6-16)21(33)30-18-9-7-17(8-10-18)29-20-12-14(2)27-23(25)32-20/h3-12H,1-2H3,(H,30,33)(H3,24,26,28,31)(H3,25,27,29,32)
n/an/a 6.80E+4n/an/an/an/an/an/a
Sapienza Universit£ di Roma
Curated by ChEMBL
Assay Description
Inhibition of human N-terminal 600 residues-deleted DNMT1 using hemimethylated (GAC)12 as substrate preincubated for 5 mins followed by substrate add...
J Med Chem 57: 701-13 (2014)
Article DOI: 10.1021/jm4012627
BindingDB Entry DOI: 10.7270/Q2028T1Q