null
SMILES: Cc1ccc(cn1)-c1ccc(nn1)N1CCC(CC1)N1CCc2ccc(F)cc12
InChI Key: InChIKey=JGHSBWAMLKSGST-UHFFFAOYSA-N
Activity Spreadsheet -- Enzyme Inhibition Constant Data from BindingDB
Found 2 hits for monomerid = 50448654
Trg + Lig
Ki
nM
ΔG°
kcal/mole
IC50
nM
Kd
nM
EC50/IC50
nM
koff
s-1
kon
M-1s-1
pHTemp
°C
Acyl-CoA desaturase 1
(Rattus norvegicus (Rat))
BDBM50448654
(CHEMBL3127534)
Show SMILES Cc1ccc(cn1)-c1ccc(nn1)N1CCC(CC1)N1CCc2ccc(F)cc12
Show InChI InChI=1S/C23H24FN5/c1-16-2-3-18(15-25-16)21-6-7-23(27-26-21)28-11-9-20(10-12-28)29-13-8-17-4-5-19(24)14-22(17)29/h2-7,14-15,20H,8-13H2,1H3
n/an/a 13n/an/an/an/an/an/a
Janssen Research and Development, LLC
Curated by ChEMBL
Assay Description
Inhibition of SCD1 in Sprague-Dawley rat liver microsomes using stearoyl-[9,10-3H]-CoA as substrate
Bioorg Med Chem Lett 24: 1437-41 (2014)
Article DOI: 10.1016/j.bmcl.2013.12.075
BindingDB Entry DOI: 10.7270/Q26M38BM
Stearoyl-CoA desaturase
(Homo sapiens (Human))
BDBM50448654
(CHEMBL3127534)
Show SMILES Cc1ccc(cn1)-c1ccc(nn1)N1CCC(CC1)N1CCc2ccc(F)cc12
Show InChI InChI=1S/C23H24FN5/c1-16-2-3-18(15-25-16)21-6-7-23(27-26-21)28-11-9-20(10-12-28)29-13-8-17-4-5-19(24)14-22(17)29/h2-7,14-15,20H,8-13H2,1H3
n/an/a 2n/an/an/an/an/an/a
Janssen Research and Development, LLC
Curated by ChEMBL
Assay Description
Inhibition of SCD1 in human A431 cells assessed as [13C]-palmitic acid conversion to [13C]-palmitoleic acid after 4 hrs by LC/MS analysis
Bioorg Med Chem Lett 24: 1437-41 (2014)
Article DOI: 10.1016/j.bmcl.2013.12.075
BindingDB Entry DOI: 10.7270/Q26M38BM