BDBM50448775 CHEMBL3128055
SMILES: CCNc1nc2ccc(cc2n1-c1ncnc(N)n1)C#CC(C)(C)O
InChI Key: InChIKey=NDZPPXQOOUNQTQ-UHFFFAOYSA-N
Data: 2 KI  2 IC50
PDB links: 1 PDB ID matches this monomer.
Activity Spreadsheet -- Enzyme Inhibition Constant Data from BindingDB
Found 4 hits for monomerid = 50448775
Trg + Lig
Ki
nM
ΔG°
kcal/mole
IC50
nM
Kd
nM
EC50/IC50
nM
koff
s-1
kon
M-1s-1
pHTemp
°C
Serine/threonine-protein kinase PAK 4
(Homo sapiens (Human))
BDBM50448775
(CHEMBL3128055)
Show SMILES CCNc1nc2ccc(cc2n1-c1ncnc(N)n1)C#CC(C)(C)O
Show InChI InChI=1S/C17H19N7O/c1-4-19-15-22-12-6-5-11(7-8-17(2,3)25)9-13(12)24(15)16-21-10-20-14(18)23-16/h5-6,9-10,25H,4H2,1-3H3,(H,19,22)(H2,18,20,21,23)
Reactome pathway
60n/an/an/an/an/an/an/an/a
Genentech
Curated by ChEMBL
Assay Description
Binding affinity to N-terminal GST-tagged recombinant human PAK4 kinase domain expressed in Escherichia coli using KKRNRRLSVA as substrate preincubat...
J Med Chem 57: 1033-45 (2014)
Article DOI: 10.1021/jm401768t
BindingDB Entry DOI: 10.7270/Q2F47QNW
3D
3D Structure (crystal)
Serine/threonine-protein kinase PAK 1
(Homo sapiens (Human))
BDBM50448775
(CHEMBL3128055)
Show SMILES CCNc1nc2ccc(cc2n1-c1ncnc(N)n1)C#CC(C)(C)O
Show InChI InChI=1S/C17H19N7O/c1-4-19-15-22-12-6-5-11(7-8-17(2,3)25)9-13(12)24(15)16-21-10-20-14(18)23-16/h5-6,9-10,25H,4H2,1-3H3,(H,19,22)(H2,18,20,21,23)
>4.50E+3n/an/an/an/an/an/an/an/a
Genentech
Curated by ChEMBL
Assay Description
Binding affinity to N-terminal GST-His-tagged recombinant human PAK1 kinase domain expressed in Escherichia coli BL21 using KKRNRRLSVA as sustrate pr...
J Med Chem 57: 1033-45 (2014)
Article DOI: 10.1021/jm401768t
BindingDB Entry DOI: 10.7270/Q2F47QNW
Serine/threonine-protein kinase PAK 4
(Homo sapiens (Human))
BDBM50448775
(CHEMBL3128055)
Show SMILES CCNc1nc2ccc(cc2n1-c1ncnc(N)n1)C#CC(C)(C)O
Show InChI InChI=1S/C17H19N7O/c1-4-19-15-22-12-6-5-11(7-8-17(2,3)25)9-13(12)24(15)16-21-10-20-14(18)23-16/h5-6,9-10,25H,4H2,1-3H3,(H,19,22)(H2,18,20,21,23)
Reactome pathway
n/an/a 66n/an/an/an/an/an/a
Therachem Research Medilab (India) Pvt. Ltd.
Curated by ChEMBL
Assay Description
Inhibition of human recombinant PAK4 kinase domain assessed as phosphorylation of FRET peptide substrate at Ser/Thr20 by Zylite assay
ACS Med Chem Lett 6: 17-8 (2015)
Article DOI: 10.1021/ml500445c
BindingDB Entry DOI: 10.7270/Q2TQ6352
3D
3D Structure (crystal)
Serine/threonine-protein kinase PAK 1
(Homo sapiens (Human))
BDBM50448775
(CHEMBL3128055)
Show SMILES CCNc1nc2ccc(cc2n1-c1ncnc(N)n1)C#CC(C)(C)O
Show InChI InChI=1S/C17H19N7O/c1-4-19-15-22-12-6-5-11(7-8-17(2,3)25)9-13(12)24(15)16-21-10-20-14(18)23-16/h5-6,9-10,25H,4H2,1-3H3,(H,19,22)(H2,18,20,21,23)
n/an/a 9.60E+3n/an/an/an/an/an/a
Therachem Research Medilab (India) Pvt. Ltd.
Curated by ChEMBL
Assay Description
Inhibition of human recombinant PAK1 kinase domain assessed as phosphorylation of FRET peptide substrate at Ser/Thr20 by Zylite assay
ACS Med Chem Lett 6: 17-8 (2015)
Article DOI: 10.1021/ml500445c
BindingDB Entry DOI: 10.7270/Q2TQ6352