BDBM50448799 CHEMBL3128204
SMILES: O=C1N(CN2CCN(Cc3ccccc3)CC2)c2ccccc2C1=O
InChI Key: InChIKey=BMIQFAZFVXOTTO-UHFFFAOYSA-N
Data: 3 IC50
Activity Spreadsheet -- Enzyme Inhibition Constant Data from BindingDB
Found 3 hits for monomerid = 50448799
Trg + Lig
Ki
nM
ΔG°
kcal/mole
IC50
nM
Kd
nM
EC50/IC50
nM
koff
s-1
kon
M-1s-1
pHTemp
°C
Aldehyde dehydrogenase 3A1 (ALDH3A1)
(Homo sapiens (Human))
BDBM50448799
(CHEMBL3128204)
Show SMILES O=C1N(CN2CCN(Cc3ccccc3)CC2)c2ccccc2C1=O
Show InChI InChI=1S/C20H21N3O2/c24-19-17-8-4-5-9-18(17)23(20(19)25)15-22-12-10-21(11-13-22)14-16-6-2-1-3-7-16/h1-9H,10-15H2
n/an/a 930n/an/an/an/an/an/a
Indiana University School of Medicine
Curated by ChEMBL
Assay Description
Inhibition of full length human ALDH3A1 expressed in Escherichia coli BL21 (DE3) using benzaldehyde as substrate preincubated for 2 mins followed by ...
J Med Chem 57: 714-22 (2014)
Article DOI: 10.1021/jm401377v
BindingDB Entry DOI: 10.7270/Q21V5GF2
Aldehyde dehydrogenase 1A1 (ALDH1A1)
(Homo sapiens (Human))
BDBM50448799
(CHEMBL3128204)
Show SMILES O=C1N(CN2CCN(Cc3ccccc3)CC2)c2ccccc2C1=O
Show InChI InChI=1S/C20H21N3O2/c24-19-17-8-4-5-9-18(17)23(20(19)25)15-22-12-10-21(11-13-22)14-16-6-2-1-3-7-16/h1-9H,10-15H2
Reactome pathway
n/an/a 5.00E+4n/an/an/an/an/an/a
Indiana University School of Medicine
Curated by ChEMBL
Assay Description
Inhibition of human ALDH1A1 using propionaldehyde as substrate preincubated for 2 mins followed by substrate addition by spectrophotometry in presenc...
J Med Chem 57: 714-22 (2014)
Article DOI: 10.1021/jm401377v
BindingDB Entry DOI: 10.7270/Q21V5GF2
Aldehyde dehydrogenase, mitochondrial
(Homo sapiens (Human))
BDBM50448799
(CHEMBL3128204)
Show SMILES O=C1N(CN2CCN(Cc3ccccc3)CC2)c2ccccc2C1=O
Show InChI InChI=1S/C20H21N3O2/c24-19-17-8-4-5-9-18(17)23(20(19)25)15-22-12-10-21(11-13-22)14-16-6-2-1-3-7-16/h1-9H,10-15H2
Reactome pathway
n/an/a>1.00E+5n/an/an/an/an/an/a
Indiana University School of Medicine
Curated by ChEMBL
Assay Description
Inhibition of human ALDH2 using propionaldehyde as substrate preincubated for 2 mins followed by substrate addition by spectrophotometry in presence ...
J Med Chem 57: 714-22 (2014)
Article DOI: 10.1021/jm401377v
BindingDB Entry DOI: 10.7270/Q21V5GF2