BDBM50448816 CHEMBL3128221
SMILES: Brc1ccc(cc1)S(=O)(=O)Nc1cccc(CNc2ncnc3n(CCc4ccccc4)ncc23)c1
InChI Key: InChIKey=CFNZCXVUFFRRIQ-UHFFFAOYSA-N
Data: 1 IC50
Activity Spreadsheet -- Enzyme Inhibition Constant Data from BindingDB
Found 1 hit for monomerid = 50448816
Trg + Lig
Ki
nM
ΔG°
kcal/mole
IC50
nM
Kd
nM
EC50/IC50
nM
koff
s-1
kon
M-1s-1
pHTemp
°C
Proto-oncogene tyrosine-protein kinase receptor Ret
(Homo sapiens (Human))
BDBM50448816
(CHEMBL3128221)
Show SMILES Brc1ccc(cc1)S(=O)(=O)Nc1cccc(CNc2ncnc3n(CCc4ccccc4)ncc23)c1
Show InChI InChI=1S/C26H23BrN6O2S/c27-21-9-11-23(12-10-21)36(34,35)32-22-8-4-7-20(15-22)16-28-25-24-17-31-33(26(24)30-18-29-25)14-13-19-5-2-1-3-6-19/h1-12,15,17-18,32H,13-14,16H2,(H,28,29,30)
n/an/a 1.29E+4n/an/an/an/an/an/a
Universit£ di Pisa
Curated by ChEMBL
Assay Description
Inhibition of recombinant human RET incubated for 5 mins with substrate prior to protein addition by fluorescence assay
J Med Chem 57: 1225-35 (2014)
Article DOI: 10.1021/jm401358b
BindingDB Entry DOI: 10.7270/Q2X34ZZP