BDBM50448824 CHEMBL3128234
SMILES: O=C(Cc1ccccc1)Nc1cccc(CNc2ncnc3n(CCc4ccccc4)ncc23)c1
InChI Key: InChIKey=HHGOVMACKKBWMS-UHFFFAOYSA-N
Data: 1 IC50
Activity Spreadsheet -- Enzyme Inhibition Constant Data from BindingDB
Found 1 hit for monomerid = 50448824
Trg + Lig
Ki
nM
ΔG°
kcal/mole
IC50
nM
Kd
nM
EC50/IC50
nM
koff
s-1
kon
M-1s-1
pHTemp
°C
Proto-oncogene tyrosine-protein kinase receptor Ret
(Homo sapiens (Human))
BDBM50448824
(CHEMBL3128234)
Show SMILES O=C(Cc1ccccc1)Nc1cccc(CNc2ncnc3n(CCc4ccccc4)ncc23)c1
Show InChI InChI=1S/C28H26N6O/c35-26(17-22-10-5-2-6-11-22)33-24-13-7-12-23(16-24)18-29-27-25-19-32-34(28(25)31-20-30-27)15-14-21-8-3-1-4-9-21/h1-13,16,19-20H,14-15,17-18H2,(H,33,35)(H,29,30,31)
n/an/a 2.26E+4n/an/an/an/an/an/a
Universit£ di Pisa
Curated by ChEMBL
Assay Description
Inhibition of recombinant human RET incubated for 5 mins with substrate prior to protein addition by fluorescence assay
J Med Chem 57: 1225-35 (2014)
Article DOI: 10.1021/jm401358b
BindingDB Entry DOI: 10.7270/Q2X34ZZP